Proof Portal
Omarchy
ProbeLabs65 findings · 95 requirementsA proof layer — requirements, tests and verified fixes — for two of Omarchy's subsystems: the application menu (launcher scripts, QML model, JSONC config, search and selection) and the lock screen (lock scripts, QML, PAM authentication). Scope is deliberately limited to those components of omacom/omarchy; the rest of the distribution is not covered.
omarchy windows vm launch fails silently when the shared folder has setgid set (numeric chmod can't clear it)
Reported by bkuenzi · filed Sep 16, 2026Closed upstream on 2026-10-04 by the bot omarchybot; the closing comment says it was fixed by PR #12323. GitHub close reason: completed.
At a glance
- 1 · What is claimed?
- Only the report text below — no validator has restated it as checkable claims yet.
- 2 · What does it affect?
- Not yet mapped to any requirement or component.
- 3 · Is it reproducible?
- No validation has been run yet.
- 4 · What remains unclear?
- Not validated yet: no claims, no reproducer.
- 5 · What happens next?
- Our staff decide whether the report is valid. Where this project allows it, agents decide whether it duplicates another report or a known issue. No decision has been recorded yet.
Original report
What happened
omarchy windows vm launch (and the desktop launcher) fails with a generic ❌ Failed to start Windows VM! and no further detail. Docker is never even started — dockerd shows no activity during the failed attempt (confirmed via journalctl).
Root cause
The ~/Windows shared-mount folder had the setgid bit set (drwx--S---, mode 2700) instead of the expected 700. prepare_caller_mounts/assert_mounts_safe in omarchy-windows-vm chmods the storage/shared folders with a numeric mode (chmod 0700) and then re-stats them to verify the change, aborting if the mode doesn't match.
GNU chmod deliberately will not clear an existing setgid bit on a directory via a numeric mode — only a symbolic mode (chmod g-s) or setting it explicitly can. So the verification step in prepare_caller_mounts can never succeed once setgid is set on that folder, and the script exits before it ever touches Docker, with no error surfaced to the user (the desktop launcher has Terminal=false, so even the internal >&2 messages, if any were printed, go nowhere visible).
Reproduced directly, outside the script:
$ chmod 2700 ~/Windows
$ chmod -v 0700 ~/Windows
mode of '/home/user/Windows' retained as 2700 (rwx--S---)
$ chmod g-s ~/Windows # this is the only thing that actually clears itI don't know how the setgid bit got set on that folder in the first place — possibly inherited at creation time, or set by an earlier version of the installer — but regardless, the script's mount-safety check can get permanently stuck against it with no recovery path or diagnostic message.
Fix
In omarchy-windows-vm, replace the numeric chmod 0700 (or whatever mode string is used) for the storage/shared boundary check with something that can actually clear setgid/setuid, e.g. chmod u=rwx,go= (symbolic) or chmod g-s,u=rwx,go= — and ideally print a clear error naming the exact directory and mode mismatch when assert_mounts_safe fails, instead of the generic "Failed to start Windows VM!".
Workaround
chmod g-s ~/WindowsSystem details
- Omarchy: 4.0.4-1
- Kernel: 7.2.6-arch2-Watanare-T2-1-t2
- Filesystem: btrfs (/home subvolume)
omarchy-debug --no-sudo --print output
Date: Wed Sep 16 02:08:44 PM EDT 2026
Hostname: omarchy
Omarchy Package: omarchy 4.0.4-1
=========================================
SYSTEM INFORMATION
=========================================
12System:
12Kernel 7.2.6-arch2-Watanare-T2-1-t2 12arch x86_64 12bits 64 12compiler gcc 12v 16.2.1 12clocksource tsc
12avail acpi_pm 12parameters cryptdevice=PARTUUID=53215a21-a225-44d2-a403-fd2663c686d2:root
root=/dev/mapper/root zswap.enabled=0 rootflags=subvol=@ rw rootfstype=btrfs intel_iommu=on
iommu=pt pm_async=off mem_sleep_default=deep resume=/dev/mapper/root resume_offset=1932693
initramfs_async=0 quiet splash loglevel=0 systemd.show_status=false rd.udev.log_level=0
vt.global_cursor_default=0
12Desktop Hyprland 12v 0.56.2 12vt 1 12dm SDDM 12Distro Omarchy
12Machine:
12Type Laptop 12System Apple 12product MacBookPro16,1 12v 1.0 12serial <superuser required> 12Chassis 12type 9
12v Mac-E1008331FDC96864 12serial <superuser required>
12Mobo Apple 12model Mac-E1008331FDC96864 12v MacBookPro16,1 12serial <superuser required>
12uuid <superuser required> 12Firmware UEFI 12vendor Apple 12v 2103.160.2.0.0 (iBridge: 24.16.6005.0.0,0)
12date 08/20/2026
12Battery:
12ID-1 BAT0 12charge 81.9 Wh (105.9%) 12note check 12condition 77.4/99.9 Wh (77.5%) 12temp 34.7 C
12volts 12.53 12min 11.36 12model DSY bq40z651 12type Li-ion 12serial N/A 12charging 12status full 12cycles 416
12CPU:
12Info 12model Intel Core i7-9750H 12bits 64 12type MT MCP 12arch Coffee Lake 12gen core 9 12level v3
12note check 12built 2018 12process Intel 14nm 12family 6 12model-id 0x9E (158) 12stepping 0xA (10)
12microcode 0xFA
12Topology 12cpus 1x 12dies 1 12clusters 6 12cores 6 12threads 12 12tpc 2 12smt enabled 12cache 12L1 384 KiB
12desc d-6x32 KiB; i-6x32 KiB 12L2 1.5 MiB 12desc 6x256 KiB 12L3 12 MiB 12desc 1x12 MiB
12Speed (MHz) 12avg 4090 12min/max 800/4500 12scaling 12driver intel_pstate 12governor powersave 12cores
121 4090 122 4090 123 4090 124 4090 125 4090 126 4090 127 4090 128 4090 129 4090 1210 4090 1211 4090 1212 4090
12bogomips 62399
12Flags-basic avx avx2 ht lm nx pae sse sse2 sse3 sse4_1 sse4_2 ssse3 vmx
12Vulnerabilities
12Type gather_data_sampling 12mitigation Microcode
12Type ghostwrite 12status Not affected
12Type indirect_target_selection 12status Not affected
12Type itlb_multihit 12status KVM: Split huge pages
12Type l1tf 12mitigation PTE Inversion; VMX: conditional cache flushes, SMT vulnerable
12Type mds 12mitigation Clear CPU buffers; SMT vulnerable
12Type meltdown 12mitigation PTI
12Type mmio_stale_data 12mitigation Clear CPU buffers; SMT vulnerable
12Type old_microcode 12status Not affected
12Type reg_file_data_sampling 12status Not affected
12Type retbleed 12mitigation IBRS
12Type spec_rstack_overflow 12status Not affected
12Type spec_store_bypass 12mitigation Speculative Store Bypass disabled via prctl
12Type spectre_v1 12mitigation usercopy/swapgs barriers and __user pointer sanitization
12Type spectre_v2 12mitigation IBRS; IBPB: conditional; STIBP: conditional; RSB filling;
PBRSB-eIBRS: Not affected; BHI: Not affected
12Type srbds 12mitigation Microcode
12Type tsa 12status Not affected
12Type tsx_async_abort 12status Not affected
12Type vmscape 12mitigation IBPB before exit to userspace
12Graphics:
12Device-1 Intel CoffeeLake-H GT2 [UHD Graphics 630] 12vendor Apple MacBookPro16 1 12driver i915
12v kernel 12arch Gen-9.5 12process Intel 14nm 12built 2016-20 12ports 12active eDP-1 12empty DP-1, DP-2,
DP-3, HDMI-A-1, HDMI-A-2, HDMI-A-3 12bus-ID 00:02.0 12chip-ID 8086:3e9b 12class-ID 0300
12Device-2 Advanced Micro Devices [AMD/ATI] Navi 14 [Radeon RX 5500/5500M / Pro 5300/5300M/5500M]
12vendor Apple 12driver amdgpu 12v kernel 12arch RDNA-1 12code Navi-1x 12process TSMC n7 (7nm) 12built 2019-20
12pcie 12gen 4 12speed 16 GT/s 12lanes 16 12ports 12active none 12off eDP-2 12empty DP-4, DP-5, DP-6, DP-7
12bus-ID 03:00.0 12chip-ID 1002:7340 12class-ID 0300
12Device-3 Apple FaceTime HD Camera (Built-in) 12driver uvcvideo 12type USB 12rev 2.0 12speed 480 Mb/s
12lanes 1 12mode 2.0 12bus-ID 9-2:7 12chip-ID 05ac:8514 12class-ID 0e02 12serial <filter>
12Display wayland 12server X.org 12v 1.21.1.24 12with Xwayland 12v 24.1.13 12compositor Hyprland 12v 0.56.2
12driver 12gpu amdgpu,i915 12display-ID 1 12note no compositor data
12Monitor-1 eDP-1 12model Apple Color LCD 12built 2019 12res 3072x1920 12dpi 226 12gamma 1.2
12size 345x215mm (13.58x8.46") 12diag 407mm (16") 12ratio 16:10 12modes 3072x1920
12Monitor-2 eDP-2 12size-res N/A 12modes N/A
12API EGL 12Message EGL data requires eglinfo. Check --recommends.
12Info 12Tools 12x11 xprop
12Audio:
12Device-1 Advanced Micro Devices [AMD/ATI] Navi 10 HDMI Audio 12driver snd_hda_intel 12v kernel 12pcie
12gen 4 12speed 16 GT/s 12lanes 16 12bus-ID 03:00.1 12chip-ID 1002:ab38 12class-ID 0403
12Device-2 Apple Audio 12driver t2bce_audio 12v 0.02 12pcie 12gen 3 12speed 8 GT/s 12lanes 4 12bus-ID 04:00.3
12chip-ID 106b:1803 12class-ID 0401
12API ALSA 12v k7.2.6-arch2-Watanare-T2-1-t2 12status kernel-api 12tools alsactl,alsamixer,amixer
12Server-1 sndiod 12v N/A 12status off 12tools aucat,midicat,sndioctl
12Server-2 PipeWire 12v 1.6.8 12status active 12with 121 pipewire-pulse 12status active 122 wireplumber
12status active 123 pipewire-alsa 12type plugin 124 pw-jack 12type plugin 12tools pactl,pw-cat,pw-cli,wpctl
12Network:
12Device-1 Broadcom BCM4364 802.11ac Wireless Network Adapter 12vendor Apple 12driver brcmfmac 12v kernel
12pcie 12gen 1 12speed 2.5 GT/s 12lanes 1 12bus-ID 05:00.0 12chip-ID 14e4:4464 12class-ID 0280
12IF wlp5s0 12state up 12mac <filter>
12IF-ID-1 br-aa29db787547 12state up 12speed 10000 Mbps 12duplex unknown 12mac <filter>
12IF-ID-2 docker0 12state down 12mac <filter>
12IF-ID-3 enp4s0f1u1 12state up 12speed 100 Mbps 12duplex unknown 12mac <filter>
12IF-ID-4 veth14ee03c 12state up 12speed 10000 Mbps 12duplex full 12mac <filter>
12Info 12services NetworkManager, nginx, smbd, systemd-timesyncd, wpa_supplicant
12Drives:
12Local Storage 12total 931.84 GiB 12used 50.22 GiB (5.4%)
12SMART Message Required tool smartctl not installed. Check --recommends
12ID-1 /dev/nvme0n1 12maj-min 259:0 12vendor Apple 12model SSD AP1024N 12size 931.84 GiB 12block-size
12physical 4096 B 12logical 4096 B 12speed 31.6 Gb/s 12lanes 4 12tech SSD 12serial <filter> 12fw-rev 1310
12temp 35.9 C 12scheme GPT
12Partition:
12ID-1 / 12raw-size 929.82 GiB 12size 929.82 GiB (100.00%) 12used 50.05 GiB (5.4%) 12fs btrfs 12dev /dev/dm-0
12maj-min 253:0 12mapped root
12ID-2 /boot 12raw-size 2 GiB 12size 2 GiB (99.80%) 12used 172 MiB (8.4%) 12fs vfat 12dev /dev/nvme0n1p1
12maj-min 259:1
12ID-3 /home 12raw-size 929.82 GiB 12size 929.82 GiB (100.00%) 12used 50.05 GiB (5.4%) 12fs btrfs
12dev /dev/dm-0 12maj-min 253:0 12mapped root
12ID-4 /var/log 12raw-size 929.82 GiB 12size 929.82 GiB (100.00%) 12used 50.05 GiB (5.4%) 12fs btrfs
12dev /dev/dm-0 12maj-min 253:0 12mapped root
12Swap:
12Kernel 12swappiness 150 (default 60) 12cache-pressure 50 (default 100) 12zswap no
12ID-1 swap-1 12type file 12size 15.51 GiB 12used 0 KiB (0.0%) 12priority 0 12file /swap/swapfile
12ID-2 swap-2 12type zram 12size 15.5 GiB 12used 0 KiB (0.0%) 12priority 100 12comp zstd
12avail lzo-rle,lzo,lz4,lz4hc,deflate,842 12dev /dev/zram0
12Sensors:
12System Temperatures 12cpu 65.0 C 12pch 61.0 C 12mobo N/A 12gpu amdgpu 12temp 63.0 C 12mem 0.0 C
12Fan Speeds (rpm) 12cpu 5443 12mobo 5059 12gpu amdgpu 12fan 0
12Repos:
12Packages 12pm pacman 12pkgs 965 12libs 271 12tools yay
12Active pacman repo servers in /etc/pacman.conf
121 https: //pkgs.omarchy.org/stable/$arch
122 https: //github.com/NoaHimesaka1873/arch-mact2-mirror/releases/download/release
12Active pacman repo servers in /etc/pacman.d/mirrorlist
121 https: //stable-mirror.omarchy.org/$repo/os/$arch
12Info:
12Memory 12total 16 GiB 12available 15.5 GiB 12used 11.67 GiB (75.3%)
12Processes 366 12Power 12uptime 23m 12states freeze,mem,disk 12suspend deep 12avail s2idle 12wakeups 0
12hibernate platform 12avail shutdown, reboot, suspend, test_resume 12image 6.07 GiB
12services power-profiles-daemon, thermald, upowerd 12Init systemd 12v 261 12default graphical
12tool systemctl
12Compilers 12clang 22.1.8 12gcc 16.2.1 12Client shell wrapper 12v 5.3.15-release 12inxi 3.3.41
=========================================
DMESG
=========================================
(skipped - --no-sudo flag used)
=========================================
JOURNALCTL (CURRENT BOOT, WARNINGS+ERRORS)
=========================================
Sep 16 13:45:38 omarchy kernel: x86/cpu: SGX disabled or unsupported by BIOS.
Sep 16 13:45:38 omarchy kernel: MDS CPU bug present and SMT on, data leak possible. See https://www.kernel.org/doc/html/latest/admin-guide/hw-vuln/mds.html for more details.
Sep 16 13:45:38 omarchy kernel: MMIO Stale Data CPU bug present and SMT on, data leak possible. See https://www.kernel.org/doc/html/latest/admin-guide/hw-vuln/processor_mmio_stale_data.html for more details.
Sep 16 13:45:38 omarchy kernel: VMSCAPE: SMT on, STIBP is required for full protection. See https://www.kernel.org/doc/html/latest/admin-guide/hw-vuln/vmscape.html for more details.
Sep 16 13:45:38 omarchy kernel: virt/tdx: TDX not supported by the host platform
Sep 16 13:45:38 omarchy kernel: ACPI Error: AE_ALREADY_EXISTS, SSDT 0xFFFF8C31C19D2C00 Table is already loaded (20260408/tbdata-548)
Sep 16 13:45:38 omarchy kernel: ACPI Error: Aborting method \_PR.CPU0.GCAP due to previous error (AE_ALREADY_EXISTS) (20260408/psparse-543)
Sep 16 13:45:38 omarchy kernel: ACPI Error: Aborting method \_PR.CPU0._OSC due to previous error (AE_ALREADY_EXISTS) (20260408/psparse-543)
Sep 16 13:45:38 omarchy kernel: ACPI Error: AE_ALREADY_EXISTS, SSDT 0xFFFF8C31C1085000 Table is already loaded (20260408/tbdata-548)
Sep 16 13:45:38 omarchy kernel: ACPI Error: Aborting method \_PR.CPU0.GCAP due to previous error (AE_ALREADY_EXISTS) (20260408/psparse-543)
Sep 16 13:45:38 omarchy kernel: ACPI Error: Aborting method \_PR.CPU0._PDC due to previous error (AE_ALREADY_EXISTS) (20260408/psparse-543)
Sep 16 13:45:38 omarchy kernel: ACPI Error: AE_ALREADY_EXISTS, SSDT 0xFFFF8C31C1081800 Table is already loaded (20260408/tbdata-548)
Sep 16 13:45:38 omarchy kernel: ACPI Error: Aborting method \_PR.CPU1.APPT due to previous error (AE_ALREADY_EXISTS) (20260408/psparse-543)
Sep 16 13:45:38 omarchy kernel: ACPI Error: Aborting method \_PR.CPU1.GCAP due to previous error (AE_ALREADY_EXISTS) (20260408/psparse-543)
Sep 16 13:45:38 omarchy kernel: ACPI Error: Aborting method \_PR.CPU1._PDC due to previous error (AE_ALREADY_EXISTS) (20260408/psparse-543)
Sep 16 13:45:38 omarchy kernel: ACPI Error: AE_ALREADY_EXISTS, SSDT 0xFFFF8C31C19D2C00 Table is already loaded (20260408/tbdata-548)
Sep 16 13:45:38 omarchy kernel: ACPI Error: Aborting method \_PR.CPU1.APCT due to previous error (AE_ALREADY_EXISTS) (20260408/psparse-543)
Sep 16 13:45:38 omarchy kernel: ACPI Error: Aborting method \_PR.CPU2.GCAP due to previous error (AE_ALREADY_EXISTS) (20260408/psparse-543)
Sep 16 13:45:38 omarchy kernel: ACPI Error: Aborting method \_PR.CPU2._PDC due to previous error (AE_ALREADY_EXISTS) (20260408/psparse-543)
Sep 16 13:45:38 omarchy kernel: ERROR: Unable to locate IOAPIC for GSI 34
Sep 16 13:45:38 omarchy kernel: ENERGY_PERF_BIAS: Set to 'normal', was 'performance'
Sep 16 13:45:38 omarchy kernel: integrity: Reading UEFI Secure Boot Certs is not supported on T2 Macs.
Sep 16 13:45:38 omarchy kernel: t2bce_dma: module is from the staging directory, the quality is unknown, you have been warned.
Sep 16 13:45:38 omarchy kernel: t2bce_core: module is from the staging directory, the quality is unknown, you have been warned.
Sep 16 13:45:38 omarchy kernel: t2bce_vhci: module is from the staging directory, the quality is unknown, you have been warned.
Sep 16 13:45:38 omarchy kernel: thunderbolt 0000:08:00.0: device links to tunneled native ports are missing!
Sep 16 13:45:38 omarchy kernel: thunderbolt 0000:7e:00.0: device links to tunneled native ports are missing!
Sep 16 13:45:38 omarchy kernel: intel-lpss INT34BA:00: error -EINVAL: IRQ index 0 not found
Sep 16 13:45:38 omarchy kernel: intel-lpss INT34BA:00: probe with driver intel-lpss failed with error -22
Sep 16 13:45:38 omarchy kernel: pci 0000:00:02.0: deferred probe pending: (reason unknown)
Sep 16 13:45:38 omarchy kernel: pci 0000:03:00.0: deferred probe pending: (reason unknown)
Sep 16 13:45:39 omarchy kernel: intel_pch_thermal 0000:00:12.0: can't derive routing for PCI INT A
Sep 16 13:45:39 omarchy kernel: intel_pch_thermal 0000:00:12.0: PCI INT A: not connected
Sep 16 13:45:39 omarchy kernel: t2bce_audio: module is from the staging directory, the quality is unknown, you have been warned.
Sep 16 13:45:39 omarchy kernel: hci_uart_bcm serial0-0: Unexpected ACPI gpio_int_idx: -1
Sep 16 13:45:39 omarchy kernel: hci_uart_bcm serial0-0: Unexpected number of ACPI GPIOs: 0
Sep 16 13:45:39 omarchy kernel: hci_uart_bcm serial0-0: No reset resource, using default baud rate
Sep 16 13:45:39 omarchy kernel: uvcvideo 5-1.4.4:1.1: Failed to set UVC probe control : -32 (exp. 26).
Sep 16 13:45:39 omarchy kernel: spi-nor spi0.0: supply vcc not found, using dummy regulator
Sep 16 13:45:39 omarchy kernel: spi-nor spi0.0: unrecognized JEDEC id bytes: f4 0c 58 12 03 00
Sep 16 13:45:39 omarchy kernel: applesmc APP0001:00: hwmon_device_register() is deprecated. Please convert the driver to use hwmon_device_register_with_info().
Sep 16 13:45:39 omarchy kernel: hid-sensor-hub 0003:05AC:8104.0009: No report with id 0xffffffff found
Sep 16 13:45:39 omarchy kernel: hid_sensor_rotation HID-SENSOR-20008a.1.auto: failed to setup common attributes
Sep 16 13:45:39 omarchy kernel: hid_sensor_rotation HID-SENSOR-20008a.1.auto: probe with driver hid_sensor_rotation failed with error -22
Sep 16 13:45:39 omarchy kernel: brcmfmac: brcmf_fw_alloc_request: using brcm/brcmfmac4364b3-pcie for chip BCM4364/4
Sep 16 13:45:39 omarchy kernel: Bluetooth: hci0: BCM: failed to write update baudrate (-16)
Sep 16 13:45:39 omarchy kernel: Bluetooth: hci0: Failed to set baudrate
Sep 16 13:45:39 omarchy kernel: Bluetooth: hci0: BCM: firmware Patch file not found, tried:
Sep 16 13:45:39 omarchy kernel: Bluetooth: hci0: BCM: 'brcm/BCM.hcd'
Sep 16 13:45:39 omarchy kernel: Bluetooth: hci0: HCI Read Transmit Power Level command is advertised, but not supported.
Sep 16 13:45:40 omarchy kernel: brcmfmac: brcmf_c_process_txcap_blob: TxCap blob found, loading
Sep 16 13:45:40 omarchy kernel: brcmfmac: brcmf_c_preinit_dcmds: Firmware: BCM4364/4 wl0: Jul 10 2023 12:53:18 version 9.30.503.0.32.5.92 FWID 01-c06f991b
Sep 16 13:45:41 omarchy kernel: workqueue: name exceeds WQ_NAME_LEN. Truncating to: hdmi_frl_status_polling_workque
Sep 16 13:45:41 omarchy wpa_supplicant[998]: wlp5s0: nl80211: kernel reports: multicast RX registrations are not supported
Sep 16 13:45:42 omarchy kernel: ieee80211 phy0: brcmf_p2p_set_firmware: failed to update device address ret -52
Sep 16 13:45:42 omarchy wpa_supplicant[998]: Failed to create interface p2p-dev-wlp5s0: -52 (Invalid exchange)
Sep 16 13:45:42 omarchy kernel: ieee80211 phy0: brcmf_p2p_create_p2pdev: set p2p_disc error
Sep 16 13:45:42 omarchy kernel: ieee80211 phy0: brcmf_cfg80211_add_iface: add iface p2p-dev-wlp5s0 type 10 failed: err=-52
Sep 16 13:45:42 omarchy wpa_supplicant[998]: nl80211: Failed to create a P2P/NAN Device interface p2p-dev-wlp5s0
Sep 16 13:45:42 omarchy NetworkManager[897]: <warn> [1789580742.0636] device (p2p-dev-wlp5s0): error setting IPv4 forwarding to '0': Resource temporarily unavailable
Sep 16 13:45:42 omarchy sddm-helper[1019]: gkr-pam: no password is available for user
Sep 16 13:45:42 omarchy dbus-broker-launch[895]: Activation request for 'org.freedesktop.home1' failed: The systemd unit 'dbus-org.freedesktop.home1.service' could not be found.
Sep 16 13:45:42 omarchy sddm-helper[1019]: gkr-pam: couldn't unlock the login keyring.
Sep 16 13:45:42 omarchy pipewire[1040]: mod.rt: RTKit error: org.freedesktop.DBus.Error.ServiceUnknown
Sep 16 13:45:42 omarchy pipewire[1040]: mod.rt: RTKit does not give us MaxRealtimePriority, using 1
Sep 16 13:45:42 omarchy pipewire-pulse[1043]: mod.rt: RTKit error: org.freedesktop.DBus.Error.ServiceUnknown
Sep 16 13:45:42 omarchy pipewire-pulse[1043]: mod.rt: RTKit does not give us MaxRealtimePriority, using 1
Sep 16 13:45:42 omarchy pipewire[1040]: mod.rt: RTKit error: org.freedesktop.DBus.Error.ServiceUnknown
Sep 16 13:45:42 omarchy pipewire[1040]: mod.rt: RTKit does not give us MinNiceLevel, using 0
Sep 16 13:45:42 omarchy pipewire-pulse[1043]: mod.rt: RTKit error: org.freedesktop.DBus.Error.ServiceUnknown
Sep 16 13:45:42 omarchy pipewire-pulse[1043]: mod.rt: RTKit does not give us MinNiceLevel, using 0
Sep 16 13:45:42 omarchy pipewire[1040]: mod.rt: RTKit error: org.freedesktop.DBus.Error.ServiceUnknown
Sep 16 13:45:42 omarchy pipewire[1040]: mod.rt: RTKit does not give us RTTimeUSecMax, using -1
Sep 16 13:45:42 omarchy pipewire-pulse[1043]: mod.rt: RTKit error: org.freedesktop.DBus.Error.ServiceUnknown
Sep 16 13:45:42 omarchy pipewire-pulse[1043]: mod.rt: RTKit does not give us RTTimeUSecMax, using -1
Sep 16 13:45:42 omarchy wireplumber[1041]: mod.rt: RTKit error: org.freedesktop.DBus.Error.ServiceUnknown
Sep 16 13:45:42 omarchy wireplumber[1041]: mod.rt: RTKit does not give us MaxRealtimePriority, using 1
Sep 16 13:45:42 omarchy wireplumber[1041]: mod.rt: RTKit error: org.freedesktop.DBus.Error.ServiceUnknown
Sep 16 13:45:42 omarchy wireplumber[1041]: mod.rt: RTKit does not give us MinNiceLevel, using 0
Sep 16 13:45:42 omarchy wireplumber[1041]: mod.rt: RTKit error: org.freedesktop.DBus.Error.ServiceUnknown
Sep 16 13:45:42 omarchy wireplumber[1041]: mod.rt: RTKit does not give us RTTimeUSecMax, using -1
Sep 16 13:45:42 omarchy wireplumber[1041]: mod.rt: RTKit error: org.freedesktop.DBus.Error.ServiceUnknown
Sep 16 13:45:42 omarchy wireplumber[1041]: mod.rt: RTKit does not give us MaxRealtimePriority, using 1
Sep 16 13:45:42 omarchy wireplumber[1041]: mod.rt: RTKit error: org.freedesktop.DBus.Error.ServiceUnknown
Sep 16 13:45:42 omarchy wireplumber[1041]: mod.rt: RTKit does not give us MinNiceLevel, using 0
Sep 16 13:45:42 omarchy wireplumber[1041]: mod.rt: RTKit error: org.freedesktop.DBus.Error.ServiceUnknown
Sep 16 13:45:42 omarchy wireplumber[1041]: mod.rt: RTKit does not give us RTTimeUSecMax, using -1
Sep 16 13:45:42 omarchy wireplumber[1041]: default: Failed to get percentage from UPower: org.freedesktop.DBus.Error.NameHasNoOwner
Sep 16 13:45:45 omarchy kernel: [drm:dm_helpers_read_local_edid [amdgpu]] *ERROR* EDID err: 2, on connector: eDP-2
Sep 16 13:45:45 omarchy kernel: amdgpu 0000:03:00.0: [drm] *ERROR* No EDID read.
Sep 16 13:45:45 omarchy wpa_supplicant[998]: wlp5s0: nl80211: kernel reports: multicast RX registrations are not supported
Sep 16 13:45:46 omarchy kernel: amdgpu 0000:03:00.0: Fence fallback timer expired on ring sdma0
Sep 16 13:45:46 omarchy kernel: amdgpu 0000:03:00.0: Fence fallback timer expired on ring sdma0
Sep 16 13:45:46 omarchy kernel: amdgpu 0000:03:00.0: [drm] Adding stream 0000000047449c5a to context failed with err 28!
Sep 16 13:45:46 omarchy kernel: amdgpu 0000:03:00.0: [drm] Adding stream 0000000047449c5a to context failed with err 28!
Sep 16 13:45:46 omarchy kernel: amdgpu 0000:03:00.0: [drm] Adding stream 0000000047449c5a to context failed with err 28!
Sep 16 13:45:46 omarchy kernel: amdgpu 0000:03:00.0: [drm] Adding stream 0000000047449c5a to context failed with err 28!
Sep 16 13:45:46 omarchy kernel: amdgpu 0000:03:00.0: [drm] Adding stream 0000000047449c5a to context failed with err 28!
Sep 16 13:45:46 omarchy kernel: amdgpu 0000:03:00.0: [drm] Adding stream 0000000047449c5a to context failed with err 28!
Sep 16 13:45:46 omarchy kernel: amdgpu 0000:03:00.0: [drm] Adding stream 00000000634d94b7 to context failed with err 28!
Sep 16 13:45:46 omarchy kernel: amdgpu 0000:03:00.0: [drm] Adding stream 00000000634d94b7 to context failed with err 28!
Sep 16 13:45:46 omarchy kernel: amdgpu 0000:03:00.0: [drm] Adding stream 00000000634d94b7 to context failed with err 28!
Sep 16 13:45:46 omarchy kernel: amdgpu 0000:03:00.0: [drm] Adding stream 00000000634d94b7 to context failed with err 28!
Sep 16 13:45:46 omarchy kernel: amdgpu 0000:03:00.0: [drm] Adding stream 00000000634d94b7 to context failed with err 28!
Sep 16 13:45:46 omarchy kernel: amdgpu 0000:03:00.0: [drm] Adding stream 00000000634d94b7 to context failed with err 28!
Sep 16 13:45:46 omarchy kernel: amdgpu 0000:03:00.0: [drm] Adding stream 00000000634d94b7 to context failed with err 28!
Sep 16 13:45:46 omarchy kernel: amdgpu 0000:03:00.0: [drm] Adding stream 00000000634d94b7 to context failed with err 28!
Sep 16 13:45:46 omarchy kernel: amdgpu 0000:03:00.0: [drm] Adding stream 00000000634d94b7 to context failed with err 28!
Sep 16 13:45:46 omarchy kernel: amdgpu 0000:03:00.0: [drm] Adding stream 00000000634d94b7 to context failed with err 28!
Sep 16 13:45:46 omarchy kernel: amdgpu 0000:03:00.0: [drm] Adding stream 00000000634d94b7 to context failed with err 28!
Sep 16 13:45:46 omarchy kernel: amdgpu 0000:03:00.0: [drm] Adding stream 00000000634d94b7 to context failed with err 28!
Sep 16 13:45:46 omarchy kernel: amdgpu 0000:03:00.0: [drm] Adding stream 00000000b4b4c05d to context failed with err 28!
Sep 16 13:45:46 omarchy kernel: amdgpu 0000:03:00.0: [drm] Adding stream 00000000b4b4c05d to context failed with err 28!
Sep 16 13:45:46 omarchy kernel: amdgpu 0000:03:00.0: [drm] Adding stream 00000000b4b4c05d to context failed with err 28!
Sep 16 13:45:46 omarchy kernel: amdgpu 0000:03:00.0: [drm] Adding stream 00000000b4b4c05d to context failed with err 28!
Sep 16 13:45:46 omarchy kernel: amdgpu 0000:03:00.0: [drm] Adding stream 00000000b4b4c05d to context failed with err 28!
Sep 16 13:45:46 omarchy kernel: amdgpu 0000:03:00.0: [drm] Adding stream 00000000b4b4c05d to context failed with err 28!
Sep 16 13:45:46 omarchy kernel: amdgpu 0000:03:00.0: [drm] Adding stream 00000000b4b4c05d to context failed with err 28!
Sep 16 13:45:46 omarchy kernel: amdgpu 0000:03:00.0: [drm] Adding stream 00000000b4b4c05d to context failed with err 28!
Sep 16 13:45:46 omarchy kernel: amdgpu 0000:03:00.0: [drm] Adding stream 00000000b4b4c05d to context failed with err 28!
Sep 16 13:45:46 omarchy kernel: amdgpu 0000:03:00.0: [drm] Adding stream 00000000b4b4c05d to context failed with err 28!
Sep 16 13:45:46 omarchy kernel: amdgpu 0000:03:00.0: [drm] Adding stream 00000000b4b4c05d to context failed with err 28!
Sep 16 13:45:46 omarchy kernel: amdgpu 0000:03:00.0: [drm] Adding stream 00000000b4b4c05d to context failed with err 28!
Sep 16 13:45:46 omarchy kernel: amdgpu 0000:03:00.0: [drm] Adding stream 00000000b4b4c05d to context failed with err 28!
Sep 16 13:45:46 omarchy kernel: amdgpu 0000:03:00.0: [drm] Adding stream 00000000b4b4c05d to context failed with err 28!
Sep 16 13:45:46 omarchy kernel: amdgpu 0000:03:00.0: [drm] Adding stream 00000000b4b4c05d to context failed with err 28!
Sep 16 13:45:46 omarchy kernel: amdgpu 0000:03:00.0: [drm] Adding stream 00000000b4b4c05d to context failed with err 28!
Sep 16 13:45:46 omarchy kernel: amdgpu 0000:03:00.0: [drm] Adding stream 00000000b4b4c05d to context failed with err 28!
Sep 16 13:45:46 omarchy kernel: amdgpu 0000:03:00.0: [drm] Adding stream 00000000b4b4c05d to context failed with err 28!
Sep 16 13:45:46 omarchy kernel: amdgpu 0000:03:00.0: [drm] Adding stream 00000000b4b4c05d to context failed with err 28!
Sep 16 13:45:46 omarchy kernel: amdgpu 0000:03:00.0: [drm] Adding stream 00000000b4b4c05d to context failed with err 28!
Sep 16 13:45:46 omarchy kernel: amdgpu 0000:03:00.0: [drm] Adding stream 00000000b4b4c05d to context failed with err 28!
Sep 16 13:45:46 omarchy kernel: amdgpu 0000:03:00.0: [drm] Adding stream 00000000b4b4c05d to context failed with err 28!
Sep 16 13:45:46 omarchy kernel: amdgpu 0000:03:00.0: [drm] Adding stream 00000000b4b4c05d to context failed with err 28!
Sep 16 13:45:46 omarchy kernel: amdgpu 0000:03:00.0: [drm] Adding stream 00000000b4b4c05d to context failed with err 28!
Sep 16 13:45:46 omarchy kernel: amdgpu 0000:03:00.0: [drm] Adding stream 00000000b4b4c05d to context failed with err 28!
Sep 16 13:45:46 omarchy kernel: amdgpu 0000:03:00.0: [drm] Adding stream 00000000b4b4c05d to context failed with err 28!
Sep 16 13:45:46 omarchy kernel: amdgpu 0000:03:00.0: [drm] Adding stream 00000000b4b4c05d to context failed with err 28!
Sep 16 13:45:46 omarchy kernel: amdgpu 0000:03:00.0: [drm] Adding stream 00000000b4b4c05d to context failed with err 28!
Sep 16 13:45:46 omarchy kernel: amdgpu 0000:03:00.0: [drm] Adding stream 00000000b4b4c05d to context failed with err 28!
Sep 16 13:45:46 omarchy kernel: amdgpu 0000:03:00.0: [drm] Adding stream 00000000b4b4c05d to context failed with err 28!
Sep 16 13:45:46 omarchy dbus-broker[896]: A security policy denied :1.36 to send method call /org/freedesktop/DBus:org.freedesktop.DBus.Monitoring.BecomeMonitor to org.freedesktop.DBus.
Sep 16 13:45:46 omarchy /usr/lib/xdg-desktop-portal[1418]: Failed to load RealtimeKit property: GDBus.Error:org.freedesktop.DBus.Error.ServiceUnknown: The name is not activatable
Sep 16 13:45:46 omarchy /usr/lib/xdg-desktop-portal[1418]: Failed to load RealtimeKit property: GDBus.Error:org.freedesktop.DBus.Error.ServiceUnknown: The name is not activatable
Sep 16 13:45:46 omarchy /usr/lib/xdg-desktop-portal[1418]: Failed to load RealtimeKit property: GDBus.Error:org.freedesktop.DBus.Error.ServiceUnknown: The name is not activatable
Sep 16 13:45:48 omarchy kernel: [UFW BLOCK] IN=enp130s0u1u3u3 OUT= MAC=01:00:5e:00:00:01:a0:ad:9f:39:ef:00:08:00 SRC=192.168.50.1 DST=224.0.0.1 LEN=36 TOS=0x00 PREC=0x00 TTL=1 ID=44541 DF PROTO=2
Sep 16 13:45:48 omarchy kernel: [UFW BLOCK] IN=wlp5s0 OUT= MAC=01:00:5e:00:00:01:a0:ad:9f:39:ef:00:08:00 SRC=192.168.50.1 DST=224.0.0.1 LEN=36 TOS=0x00 PREC=0x00 TTL=1 ID=44541 DF PROTO=2
Sep 16 13:46:08 omarchy kernel: [UFW BLOCK] IN=enp130s0u1u3u3 OUT= MAC=01:00:5e:00:00:01:a0:ad:9f:39:ef:00:08:00 SRC=192.168.50.1 DST=224.0.0.1 LEN=36 TOS=0x00 PREC=0x00 TTL=1 ID=46937 DF PROTO=2
Sep 16 13:46:08 omarchy kernel: [UFW BLOCK] IN=wlp5s0 OUT= MAC=01:00:5e:00:00:01:a0:ad:9f:39:ef:00:08:00 SRC=192.168.50.1 DST=224.0.0.1 LEN=36 TOS=0x00 PREC=0x00 TTL=1 ID=46937 DF PROTO=2
Sep 16 13:46:13 omarchy kernel: [UFW BLOCK] IN=enp130s0u1u3u3 OUT= MAC=34:99:71:e1:92:9c:a0:ad:9f:39:ef:00:08:00 SRC=104.18.6.94 DST=192.168.50.81 LEN=95 TOS=0x00 PREC=0x00 TTL=57 ID=52673 DF PROTO=TCP SPT=443 DPT=52487 WINDOW=16 RES=0x00 ACK PSH URGP=0
Sep 16 13:46:14 omarchy kernel: [UFW BLOCK] IN=enp130s0u1u3u3 OUT= MAC=34:99:71:e1:92:9c:a0:ad:9f:39:ef:00:08:00 SRC=160.79.104.10 DST=192.168.50.81 LEN=105 TOS=0x00 PREC=0x00 TTL=55 ID=7548 DF PROTO=TCP SPT=443 DPT=51904 WINDOW=78 RES=0x00 ACK PSH URGP=0
Sep 16 13:46:28 omarchy NetworkManager[897]: <warn> [1789580788.6280] device (enp4s0f1u1): Activation: failed for connection 'Wired connection 2'
Sep 16 13:46:30 omarchy kernel: [UFW BLOCK] IN=enp130s0u1u3u3 OUT= MAC=01:00:5e:00:00:01:a0:ad:9f:39:ef:00:08:00 SRC=192.168.50.1 DST=224.0.0.1 LEN=36 TOS=0x00 PREC=0x00 TTL=1 ID=56272 DF PROTO=2
Sep 16 13:46:30 omarchy kernel: [UFW BLOCK] IN=wlp5s0 OUT= MAC=01:00:5e:00:00:01:a0:ad:9f:39:ef:00:08:00 SRC=192.168.50.1 DST=224.0.0.1 LEN=36 TOS=0x00 PREC=0x00 TTL=1 ID=56272 DF PROTO=2
Sep 16 13:46:50 omarchy kernel: [UFW BLOCK] IN=enp130s0u1u3u3 OUT= MAC=01:00:5e:00:00:01:a0:ad:9f:39:ef:00:08:00 SRC=192.168.50.1 DST=224.0.0.1 LEN=36 TOS=0x00 PREC=0x00 TTL=1 ID=2738 DF PROTO=2
Sep 16 13:46:50 omarchy kernel: [UFW BLOCK] IN=wlp5s0 OUT= MAC=01:00:5e:00:00:01:a0:ad:9f:39:ef:00:08:00 SRC=192.168.50.1 DST=224.0.0.1 LEN=36 TOS=0x00 PREC=0x00 TTL=1 ID=2738 DF PROTO=2
Sep 16 13:47:10 omarchy kernel: [UFW BLOCK] IN=enp130s0u1u3u3 OUT= MAC=01:00:5e:00:00:01:a0:ad:9f:39:ef:00:08:00 SRC=192.168.50.1 DST=224.0.0.1 LEN=36 TOS=0x00 PREC=0x00 TTL=1 ID=14358 DF PROTO=2
Sep 16 13:47:10 omarchy kernel: [UFW BLOCK] IN=wlp5s0 OUT= MAC=01:00:5e:00:00:01:a0:ad:9f:39:ef:00:08:00 SRC=192.168.50.1 DST=224.0.0.1 LEN=36 TOS=0x00 PREC=0x00 TTL=1 ID=14358 DF PROTO=2
Sep 16 13:47:10 omarchy NetworkManager[897]: <warn> [1789580830.9880] dns-sd-resolved[fe87d5de75da6be4]: send-updates SetLinkDomains@2 failed: GDBus.Error:org.freedesktop.resolve1.NoSuchLink: Link 2 not known
Sep 16 13:47:11 omarchy wireplumber[1041]: spa.alsa: 0x55a7f06fe128: poll fd error/hangup (card removed?), removing poll sources
Sep 16 13:47:13 omarchy NetworkManager[897]: <warn> [1789580833.6247] device (enp4s0f1u1): Activation: failed for connection 'Wired connection 2'
Sep 16 13:47:30 omarchy kernel: [UFW BLOCK] IN=wlp5s0 OUT= MAC=01:00:5e:00:00:01:a0:ad:9f:39:ef:00:08:00 SRC=192.168.50.1 DST=224.0.0.1 LEN=36 TOS=0x00 PREC=0x00 TTL=1 ID=23580 DF PROTO=2
Sep 16 13:47:49 omarchy kernel: workqueue: work func appletb_inactivity_work [hid_appletb_kbd] enqueued on deprecated workqueue. Use system_{percpu|dfl}_wq instead.
Sep 16 13:47:50 omarchy kernel: [UFW BLOCK] IN=wlp5s0 OUT= MAC=01:00:5e:00:00:01:a0:ad:9f:39:ef:00:08:00 SRC=192.168.50.1 DST=224.0.0.1 LEN=36 TOS=0x00 PREC=0x00 TTL=1 ID=24411 DF PROTO=2
Sep 16 13:47:58 omarchy NetworkManager[897]: <warn> [1789580878.6245] device (enp4s0f1u1): Activation: failed for connection 'Wired connection 2'
Sep 16 13:48:10 omarchy kernel: [UFW BLOCK] IN=wlp5s0 OUT= MAC=01:00:5e:00:00:01:a0:ad:9f:39:ef:00:08:00 SRC=192.168.50.1 DST=224.0.0.1 LEN=36 TOS=0x00 PREC=0x00 TTL=1 ID=34881 DF PROTO=2
Sep 16 13:48:30 omarchy kernel: [UFW BLOCK] IN=wlp5s0 OUT= MAC=01:00:5e:00:00:01:a0:ad:9f:39:ef:00:08:00 SRC=192.168.50.1 DST=224.0.0.1 LEN=36 TOS=0x00 PREC=0x00 TTL=1 ID=36942 DF PROTO=2
Sep 16 13:48:43 omarchy NetworkManager[897]: <warn> [1789580923.6251] device (enp4s0f1u1): Activation: failed for connection 'Wired connection 2'
Sep 16 13:48:50 omarchy kernel: [UFW BLOCK] IN=wlp5s0 OUT= MAC=01:00:5e:00:00:01:a0:ad:9f:39:ef:00:08:00 SRC=192.168.50.1 DST=224.0.0.1 LEN=36 TOS=0x00 PREC=0x00 TTL=1 ID=54540 DF PROTO=2
Sep 16 13:48:55 omarchy kernel: amdgpu 0000:03:00.0: Got zero output on CG_TACH_STATUS reading!
Sep 16 13:49:10 omarchy kernel: [UFW BLOCK] IN=wlp5s0 OUT= MAC=01:00:5e:00:00:01:a0:ad:9f:39:ef:00:08:00 SRC=192.168.50.1 DST=224.0.0.1 LEN=36 TOS=0x00 PREC=0x00 TTL=1 ID=7724 DF PROTO=2
Sep 16 13:49:30 omarchy kernel: [UFW BLOCK] IN=wlp5s0 OUT= MAC=01:00:5e:00:00:01:a0:ad:9f:39:ef:00:08:00 SRC=192.168.50.1 DST=224.0.0.1 LEN=36 TOS=0x00 PREC=0x00 TTL=1 ID=22627 DF PROTO=2
Sep 16 13:49:50 omarchy kernel: [UFW BLOCK] IN=wlp5s0 OUT= MAC=01:00:5e:00:00:01:a0:ad:9f:39:ef:00:08:00 SRC=192.168.50.1 DST=224.0.0.1 LEN=36 TOS=0x00 PREC=0x00 TTL=1 ID=24738 DF PROTO=2
Sep 16 13:50:10 omarchy kernel: [UFW BLOCK] IN=wlp5s0 OUT= MAC=01:00:5e:00:00:01:a0:ad:9f:39:ef:00:08:00 SRC=192.168.50.1 DST=224.0.0.1 LEN=36 TOS=0x00 PREC=0x00 TTL=1 ID=41016 DF PROTO=2
Sep 16 13:50:50 omarchy kernel: [UFW BLOCK] IN=wlp5s0 OUT= MAC=01:00:5e:00:00:01:a0:ad:9f:39:ef:00:08:00 SRC=192.168.50.1 DST=224.0.0.1 LEN=36 TOS=0x00 PREC=0x00 TTL=1 ID=59157 DF PROTO=2
Sep 16 13:51:10 omarchy kernel: [UFW BLOCK] IN=wlp5s0 OUT= MAC=01:00:5e:00:00:01:a0:ad:9f:39:ef:00:08:00 SRC=192.168.50.1 DST=224.0.0.1 LEN=36 TOS=0x00 PREC=0x00 TTL=1 ID=1268 DF PROTO=2
Sep 16 13:51:30 omarchy kernel: [UFW BLOCK] IN=wlp5s0 OUT= MAC=01:00:5e:00:00:01:a0:ad:9f:39:ef:00:08:00 SRC=192.168.50.1 DST=224.0.0.1 LEN=36 TOS=0x00 PREC=0x00 TTL=1 ID=11919 DF PROTO=2
Sep 16 13:51:50 omarchy kernel: [UFW BLOCK] IN=wlp5s0 OUT= MAC=01:00:5e:00:00:01:a0:ad:9f:39:ef:00:08:00 SRC=192.168.50.1 DST=224.0.0.1 LEN=36 TOS=0x00 PREC=0x00 TTL=1 ID=17123 DF PROTO=2
Sep 16 13:52:10 omarchy kernel: [UFW BLOCK] IN=wlp5s0 OUT= MAC=01:00:5e:00:00:01:a0:ad:9f:39:ef:00:08:00 SRC=192.168.50.1 DST=224.0.0.1 LEN=36 TOS=0x00 PREC=0x00 TTL=1 ID=30072 DF PROTO=2
Sep 16 13:52:30 omarchy kernel: [UFW BLOCK] IN=wlp5s0 OUT= MAC=01:00:5e:00:00:01:a0:ad:9f:39:ef:00:08:00 SRC=192.168.50.1 DST=224.0.0.1 LEN=36 TOS=0x00 PREC=0x00 TTL=1 ID=37772 DF PROTO=2
Sep 16 13:52:50 omarchy kernel: [UFW BLOCK] IN=wlp5s0 OUT= MAC=01:00:5e:00:00:01:a0:ad:9f:39:ef:00:08:00 SRC=192.168.50.1 DST=224.0.0.1 LEN=36 TOS=0x00 PREC=0x00 TTL=1 ID=49768 DF PROTO=2
Sep 16 13:53:10 omarchy kernel: [UFW BLOCK] IN=wlp5s0 OUT= MAC=01:00:5e:00:00:01:a0:ad:9f:39:ef:00:08:00 SRC=192.168.50.1 DST=224.0.0.1 LEN=36 TOS=0x00 PREC=0x00 TTL=1 ID=60335 DF PROTO=2
Sep 16 13:53:30 omarchy kernel: [UFW BLOCK] IN=wlp5s0 OUT= MAC=01:00:5e:00:00:01:a0:ad:9f:39:ef:00:08:00 SRC=192.168.50.1 DST=224.0.0.1 LEN=36 TOS=0x00 PREC=0x00 TTL=1 ID=7321 DF PROTO=2
Sep 16 13:53:50 omarchy kernel: [UFW BLOCK] IN=wlp5s0 OUT= MAC=01:00:5e:00:00:01:a0:ad:9f:39:ef:00:08:00 SRC=192.168.50.1 DST=224.0.0.1 LEN=36 TOS=0x00 PREC=0x00 TTL=1 ID=9321 DF PROTO=2
Sep 16 13:54:10 omarchy kernel: [UFW BLOCK] IN=wlp5s0 OUT= MAC=01:00:5e:00:00:01:a0:ad:9f:39:ef:00:08:00 SRC=192.168.50.1 DST=224.0.0.1 LEN=36 TOS=0x00 PREC=0x00 TTL=1 ID=17827 DF PROTO=2
Sep 16 13:54:28 omarchy NetworkManager[897]: <warn> [1789581268.6272] device (enp4s0f1u1): Activation: failed for connection 'Wired connection 2'
Sep 16 13:54:30 omarchy kernel: [UFW BLOCK] IN=wlp5s0 OUT= MAC=01:00:5e:00:00:01:a0:ad:9f:39:ef:00:08:00 SRC=192.168.50.1 DST=224.0.0.1 LEN=36 TOS=0x00 PREC=0x00 TTL=1 ID=30642 DF PROTO=2
Sep 16 13:54:50 omarchy kernel: [UFW BLOCK] IN=wlp5s0 OUT= MAC=01:00:5e:00:00:01:a0:ad:9f:39:ef:00:08:00 SRC=192.168.50.1 DST=224.0.0.1 LEN=36 TOS=0x00 PREC=0x00 TTL=1 ID=43544 DF PROTO=2
Sep 16 13:55:10 omarchy kernel: [UFW BLOCK] IN=wlp5s0 OUT= MAC=01:00:5e:00:00:01:a0:ad:9f:39:ef:00:08:00 SRC=192.168.50.1 DST=224.0.0.1 LEN=36 TOS=0x00 PREC=0x00 TTL=1 ID=56277 DF PROTO=2
Sep 16 13:55:13 omarchy NetworkManager[897]: <warn> [1789581313.6231] device (enp4s0f1u1): Activation: failed for connection 'Wired connection 2'
Sep 16 13:55:29 omarchy sudo[9356]: bkuenzi : a password is required ; PWD=/home/bkuenzi/Work ; USER=root ; COMMAND=/usr/bin/test -f /var/lib/omarchy/windows/docker-compose.yml
Sep 16 13:55:30 omarchy kernel: [UFW BLOCK] IN=wlp5s0 OUT= MAC=01:00:5e:00:00:01:a0:ad:9f:39:ef:00:08:00 SRC=192.168.50.1 DST=224.0.0.1 LEN=36 TOS=0x00 PREC=0x00 TTL=1 ID=58134 DF PROTO=2
Sep 16 13:55:35 omarchy sudo[9375]: bkuenzi : a password is required ; PWD=/home/bkuenzi/Work ; USER=root ; COMMAND=/usr/bin/true
Sep 16 13:55:50 omarchy kernel: [UFW BLOCK] IN=wlp5s0 OUT= MAC=01:00:5e:00:00:01:a0:ad:9f:39:ef:00:08:00 SRC=192.168.50.1 DST=224.0.0.1 LEN=36 TOS=0x00 PREC=0x00 TTL=1 ID=5863 DF PROTO=2
Sep 16 13:55:58 omarchy NetworkManager[897]: <warn> [1789581358.6281] device (enp4s0f1u1): Activation: failed for connection 'Wired connection 2'
Sep 16 13:56:10 omarchy kernel: [UFW BLOCK] IN=wlp5s0 OUT= MAC=01:00:5e:00:00:01:a0:ad:9f:39:ef:00:08:00 SRC=192.168.50.1 DST=224.0.0.1 LEN=36 TOS=0x00 PREC=0x00 TTL=1 ID=19358 DF PROTO=2
Sep 16 13:56:30 omarchy kernel: [UFW BLOCK] IN=wlp5s0 OUT= MAC=01:00:5e:00:00:01:a0:ad:9f:39:ef:00:08:00 SRC=192.168.50.1 DST=224.0.0.1 LEN=36 TOS=0x00 PREC=0x00 TTL=1 ID=35395 DF PROTO=2
Sep 16 13:56:43 omarchy NetworkManager[897]: <warn> [1789581403.6252] device (enp4s0f1u1): Activation: failed for connection 'Wired connection 2'
Sep 16 13:56:50 omarchy kernel: [UFW BLOCK] IN=wlp5s0 OUT= MAC=01:00:5e:00:00:01:a0:ad:9f:39:ef:00:08:00 SRC=192.168.50.1 DST=224.0.0.1 LEN=36 TOS=0x00 PREC=0x00 TTL=1 ID=48464 DF PROTO=2
Sep 16 13:57:10 omarchy kernel: [UFW BLOCK] IN=wlp5s0 OUT= MAC=01:00:5e:00:00:01:a0:ad:9f:39:ef:00:08:00 SRC=192.168.50.1 DST=224.0.0.1 LEN=36 TOS=0x00 PREC=0x00 TTL=1 ID=49047 DF PROTO=2
Sep 16 13:57:30 omarchy kernel: [UFW BLOCK] IN=wlp5s0 OUT= MAC=01:00:5e:00:00:01:a0:ad:9f:39:ef:00:08:00 SRC=192.168.50.1 DST=224.0.0.1 LEN=36 TOS=0x00 PREC=0x00 TTL=1 ID=60874 DF PROTO=2
Sep 16 13:57:50 omarchy kernel: [UFW BLOCK] IN=wlp5s0 OUT= MAC=01:00:5e:00:00:01:a0:ad:9f:39:ef:00:08:00 SRC=192.168.50.1 DST=224.0.0.1 LEN=36 TOS=0x00 PREC=0x00 TTL=1 ID=7503 DF PROTO=2
Sep 16 13:58:10 omarchy kernel: [UFW BLOCK] IN=wlp5s0 OUT= MAC=01:00:5e:00:00:01:a0:ad:9f:39:ef:00:08:00 SRC=192.168.50.1 DST=224.0.0.1 LEN=36 TOS=0x00 PREC=0x00 TTL=1 ID=9571 DF PROTO=2
Sep 16 13:58:50 omarchy kernel: [UFW BLOCK] IN=wlp5s0 OUT= MAC=01:00:5e:00:00:01:a0:ad:9f:39:ef:00:08:00 SRC=192.168.50.1 DST=224.0.0.1 LEN=36 TOS=0x00 PREC=0x00 TTL=1 ID=34645 DF PROTO=2
Sep 16 13:59:10 omarchy kernel: [UFW BLOCK] IN=wlp5s0 OUT= MAC=01:00:5e:00:00:01:a0:ad:9f:39:ef:00:08:00 SRC=192.168.50.1 DST=224.0.0.1 LEN=36 TOS=0x00 PREC=0x00 TTL=1 ID=48002 DF PROTO=2
Sep 16 13:59:30 omarchy kernel: [UFW BLOCK] IN=wlp5s0 OUT= MAC=01:00:5e:00:00:01:a0:ad:9f:39:ef:00:08:00 SRC=192.168.50.1 DST=224.0.0.1 LEN=36 TOS=0x00 PREC=0x00 TTL=1 ID=61666 DF PROTO=2
Sep 16 13:59:45 omarchy sudo[11573]: bkuenzi : a password is required ; PWD=/home/bkuenzi/Work ; USER=root ; COMMAND=/usr/bin/true
Sep 16 13:59:50 omarchy kernel: [UFW BLOCK] IN=wlp5s0 OUT= MAC=01:00:5e:00:00:01:a0:ad:9f:39:ef:00:08:00 SRC=192.168.50.1 DST=224.0.0.1 LEN=36 TOS=0x00 PREC=0x00 TTL=1 ID=8732 DF PROTO=2
Sep 16 14:00:10 omarchy kernel: [UFW BLOCK] IN=wlp5s0 OUT= MAC=01:00:5e:00:00:01:a0:ad:9f:39:ef:00:08:00 SRC=192.168.50.1 DST=224.0.0.1 LEN=36 TOS=0x00 PREC=0x00 TTL=1 ID=18287 DF PROTO=2
Sep 16 14:00:30 omarchy kernel: [UFW BLOCK] IN=wlp5s0 OUT= MAC=01:00:5e:00:00:01:a0:ad:9f:39:ef:00:08:00 SRC=192.168.50.1 DST=224.0.0.1 LEN=36 TOS=0x00 PREC=0x00 TTL=1 ID=29764 DF PROTO=2
Sep 16 14:00:50 omarchy kernel: [UFW BLOCK] IN=wlp5s0 OUT= MAC=01:00:5e:00:00:01:a0:ad:9f:39:ef:00:08:00 SRC=192.168.50.1 DST=224.0.0.1 LEN=36 TOS=0x00 PREC=0x00 TTL=1 ID=31285 DF PROTO=2
Sep 16 14:01:10 omarchy kernel: [UFW BLOCK] IN=wlp5s0 OUT= MAC=01:00:5e:00:00:01:a0:ad:9f:39:ef:00:08:00 SRC=192.168.50.1 DST=224.0.0.1 LEN=36 TOS=0x00 PREC=0x00 TTL=1 ID=35265 DF PROTO=2
Sep 16 14:01:30 omarchy kernel: [UFW BLOCK] IN=wlp5s0 OUT= MAC=01:00:5e:00:00:01:a0:ad:9f:39:ef:00:08:00 SRC=192.168.50.1 DST=224.0.0.1 LEN=36 TOS=0x00 PREC=0x00 TTL=1 ID=41286 DF PROTO=2
Sep 16 14:01:39 omarchy kernel: kvm_intel: L1TF CPU bug present and SMT on, data leak possible. See CVE-2018-3646 and https://www.kernel.org/doc/html/latest/admin-guide/hw-vuln/l1tf.html for details.
Sep 16 14:01:50 omarchy kernel: [UFW BLOCK] IN=wlp5s0 OUT= MAC=01:00:5e:00:00:01:a0:ad:9f:39:ef:00:08:00 SRC=192.168.50.1 DST=224.0.0.1 LEN=36 TOS=0x00 PREC=0x00 TTL=1 ID=45261 DF PROTO=2
Sep 16 14:02:10 omarchy kernel: [UFW BLOCK] IN=wlp5s0 OUT= MAC=01:00:5e:00:00:01:a0:ad:9f:39:ef:00:08:00 SRC=192.168.50.1 DST=224.0.0.1 LEN=36 TOS=0x00 PREC=0x00 TTL=1 ID=51197 DF PROTO=2
Sep 16 14:02:28 omarchy NetworkManager[897]: <warn> [1789581748.6271] device (enp4s0f1u1): Activation: failed for connection 'Wired connection 2'
Sep 16 14:02:30 omarchy kernel: [UFW BLOCK] IN=wlp5s0 OUT= MAC=01:00:5e:00:00:01:a0:ad:9f:39:ef:00:08:00 SRC=192.168.50.1 DST=224.0.0.1 LEN=36 TOS=0x00 PREC=0x00 TTL=1 ID=62982 DF PROTO=2
Sep 16 14:02:50 omarchy kernel: [UFW BLOCK] IN=wlp5s0 OUT= MAC=01:00:5e:00:00:01:a0:ad:9f:39:ef:00:08:00 SRC=192.168.50.1 DST=224.0.0.1 LEN=36 TOS=0x00 PREC=0x00 TTL=1 ID=10567 DF PROTO=2
Sep 16 14:03:10 omarchy kernel: [UFW BLOCK] IN=wlp5s0 OUT= MAC=01:00:5e:00:00:01:a0:ad:9f:39:ef:00:08:00 SRC=192.168.50.1 DST=224.0.0.1 LEN=36 TOS=0x00 PREC=0x00 TTL=1 ID=18705 DF PROTO=2
Sep 16 14:03:13 omarchy NetworkManager[897]: <warn> [1789581793.6241] device (enp4s0f1u1): Activation: failed for connection 'Wired connection 2'
Sep 16 14:03:30 omarchy kernel: [UFW BLOCK] IN=wlp5s0 OUT= MAC=01:00:5e:00:00:01:a0:ad:9f:39:ef:00:08:00 SRC=192.168.50.1 DST=224.0.0.1 LEN=36 TOS=0x00 PREC=0x00 TTL=1 ID=21293 DF PROTO=2
Sep 16 14:03:50 omarchy kernel: [UFW BLOCK] IN=wlp5s0 OUT= MAC=01:00:5e:00:00:01:a0:ad:9f:39:ef:00:08:00 SRC=192.168.50.1 DST=224.0.0.1 LEN=36 TOS=0x00 PREC=0x00 TTL=1 ID=31861 DF PROTO=2
Sep 16 14:03:58 omarchy NetworkManager[897]: <warn> [1789581838.6270] device (enp4s0f1u1): Activation: failed for connection 'Wired connection 2'
Sep 16 14:04:10 omarchy kernel: [UFW BLOCK] IN=wlp5s0 OUT= MAC=01:00:5e:00:00:01:a0:ad:9f:39:ef:00:08:00 SRC=192.168.50.1 DST=224.0.0.1 LEN=36 TOS=0x00 PREC=0x00 TTL=1 ID=46434 DF PROTO=2
Sep 16 14:04:30 omarchy kernel: [UFW BLOCK] IN=wlp5s0 OUT= MAC=01:00:5e:00:00:01:a0:ad:9f:39:ef:00:08:00 SRC=192.168.50.1 DST=224.0.0.1 LEN=36 TOS=0x00 PREC=0x00 TTL=1 ID=57892 DF PROTO=2
Sep 16 14:04:43 omarchy NetworkManager[897]: <warn> [1789581883.6240] device (enp4s0f1u1): Activation: failed for connection 'Wired connection 2'
Sep 16 14:04:50 omarchy kernel: [UFW BLOCK] IN=wlp5s0 OUT= MAC=01:00:5e:00:00:01:a0:ad:9f:39:ef:00:08:00 SRC=192.168.50.1 DST=224.0.0.1 LEN=36 TOS=0x00 PREC=0x00 TTL=1 ID=62024 DF PROTO=2
Sep 16 14:05:10 omarchy kernel: [UFW BLOCK] IN=wlp5s0 OUT= MAC=01:00:5e:00:00:01:a0:ad:9f:39:ef:00:08:00 SRC=192.168.50.1 DST=224.0.0.1 LEN=36 TOS=0x00 PREC=0x00 TTL=1 ID=2244 DF PROTO=2
Sep 16 14:05:30 omarchy kernel: [UFW BLOCK] IN=wlp5s0 OUT= MAC=01:00:5e:00:00:01:a0:ad:9f:39:ef:00:08:00 SRC=192.168.50.1 DST=224.0.0.1 LEN=36 TOS=0x00 PREC=0x00 TTL=1 ID=14099 DF PROTO=2
Sep 16 14:05:57 omarchy kernel: warning: `ThreadPoolForeg' uses wireless extensions which will stop working for Wi-Fi 7 hardware; use nl80211
Sep 16 14:06:10 omarchy kernel: [UFW BLOCK] IN=wlp5s0 OUT= MAC=01:00:5e:00:00:01:a0:ad:9f:39:ef:00:08:00 SRC=192.168.50.1 DST=224.0.0.1 LEN=36 TOS=0x00 PREC=0x00 TTL=1 ID=36267 DF PROTO=2
Sep 16 14:06:30 omarchy kernel: [UFW BLOCK] IN=wlp5s0 OUT= MAC=01:00:5e:00:00:01:a0:ad:9f:39:ef:00:08:00 SRC=192.168.50.1 DST=224.0.0.1 LEN=36 TOS=0x00 PREC=0x00 TTL=1 ID=45750 DF PROTO=2
Sep 16 14:06:50 omarchy kernel: [UFW BLOCK] IN=wlp5s0 OUT= MAC=01:00:5e:00:00:01:a0:ad:9f:39:ef:00:08:00 SRC=192.168.50.1 DST=224.0.0.1 LEN=36 TOS=0x00 PREC=0x00 TTL=1 ID=56862 DF PROTO=2
Sep 16 14:07:10 omarchy kernel: [UFW BLOCK] IN=wlp5s0 OUT= MAC=01:00:5e:00:00:01:a0:ad:9f:39:ef:00:08:00 SRC=192.168.50.1 DST=224.0.0.1 LEN=36 TOS=0x00 PREC=0x00 TTL=1 ID=64878 DF PROTO=2
Sep 16 14:07:30 omarchy kernel: [UFW BLOCK] IN=wlp5s0 OUT= MAC=01:00:5e:00:00:01:a0:ad:9f:39:ef:00:08:00 SRC=192.168.50.1 DST=224.0.0.1 LEN=36 TOS=0x00 PREC=0x00 TTL=1 ID=15661 DF PROTO=2
Sep 16 14:08:10 omarchy kernel: [UFW BLOCK] IN=wlp5s0 OUT= MAC=01:00:5e:00:00:01:a0:ad:9f:39:ef:00:08:00 SRC=192.168.50.1 DST=224.0.0.1 LEN=36 TOS=0x00 PREC=0x00 TTL=1 ID=24743 DF PROTO=2
Sep 16 14:08:30 omarchy kernel: [UFW BLOCK] IN=wlp5s0 OUT= MAC=01:00:5e:00:00:01:a0:ad:9f:39:ef:00:08:00 SRC=192.168.50.1 DST=224.0.0.1 LEN=36 TOS=0x00 PREC=0x00 TTL=1 ID=38083 DF PROTO=2
=========================================
INSTALLED PACKAGES
=========================================
aether 4.29.8-1 (omarchy)
alsa-utils 1.2.16-1 (extra)
apple-bcm-firmware 14.0-1 (AUR)
apple-t2-audio-config 0.4.r21.ga973d53-1 (arch-mact2)
asdcontrol 1:0.6.0-2 (omarchy)
base 3-3 (core)
base-devel 1-2 (core)
bash-completion 2.18.0-1 (extra)
bat 0.26.1-2 (extra)
bluez 5.87-2 (extra)
bluez-tools 0.2.0-6 (extra)
bluez-utils 5.87-2 (extra)
bolt 0.9.11-3 (extra)
brightnessctl 0.5.1-3 (extra)
btop 1.4.7-1 (extra)
btrfs-progs 7.1-1 (core)
chromium 152.0.7977.82-1 (extra)
clang 22.1.8-1 (extra)
cliamp 2.0.1-1 (omarchy)
cups 2:2.4.19-1 (extra)
cups-filters 2.0.1-2 (extra)
cups-pk-helper 0.2.7-2 (extra)
ddcutil 2.2.7-1 (extra)
docker 1:29.7.2-1 (extra)
docker-buildx 0.37.0-1 (extra)
docker-compose 5.5.1-1 (extra)
dosfstools 4.2-5 (core)
dotnet-runtime 10.0.11.sdk111-1 (extra)
dua-cli 2.44.0-1 (extra)
efibootmgr 18-4 (core)
evince 1:48.4-1 (extra)
exfatprogs 1.4.3-1 (extra)
expac 10-13 (extra)
eza 0.23.5-2 (extra)
fastfetch 2.68.1-1 (extra)
fcitx5 5.1.22-1 (extra)
fcitx5-gtk 5.1.7-1 (extra)
fcitx5-qt 5.1.15-1 (extra)
fd 10.5.0-3 (extra)
ffmpegthumbnailer 2.3.1-1 (extra)
foot 1.28.0-1 (extra)
freerdp 2:3.31.1-1 (extra)
fzf 0.74.3-1 (extra)
git 2.55.0-1 (extra)
gnome-disk-utility 46.1-3 (extra)
gnome-keyring 1:50.0-1 (extra)
gnome-themes-extra 1:3.28-1 (extra)
gpu-screen-recorder 5.12.3-2 (omarchy)
gpu-screen-recorder 6.1.0-1 (extra)
grim 1.5.0-2 (extra)
gst-plugin-pipewire 1:1.6.8-1 (extra)
gvfs-mtp 1.60.2-4 (extra)
gvfs-nfs 1.60.2-4 (extra)
gvfs-smb 1.60.2-4 (extra)
herdr 0.8.2-1 (omarchy)
hyprland 0.56.2-2 (extra)
hyprland-guiutils 0.2.2-3 (extra)
hyprland-preview-share-picker 0.2.1-1 (omarchy)
hyprpicker 0.4.7-4 (extra)
hyprsunset 0.4.0-3 (extra)
imagemagick 7.1.2.31-1 (extra)
imv 5.0.1-2 (extra)
inetutils 2.8-1 (core)
inotify-tools 4.25.9.0-1 (extra)
intel-media-driver 26.2.4-1 (extra)
intel-ucode 20260812-1 (extra)
inxi 3.3.41.1-1 (extra)
jq 1.8.2-1 (extra)
kdenlive 26.08.0-1 (extra)
kernel-modules-hook 0.1.7-3 (extra)
lazydocker 0.25.2-1 (extra)
lazygit 0.65.0-1 (extra)
less 1:704-1 (core)
libpulse 17.0+r98+gb096704c0-1 (extra)
libreoffice-fresh 26.8.0-2 (extra)
libvips 8.18.6-1 (extra)
libyaml 0.2.5-3 (extra)
limine 12.8.0-1 (extra)
linux-firmware 20260810-2 (core)
linux-t2 7.2.6.arch2-1 (arch-mact2)
linux-t2-headers 7.2.6.arch2-1 (arch-mact2)
llvm 22.1.8-2 (extra)
localsend 1.18.2-1 (omarchy)
lua51 5.1.5-13 (extra)
luarocks 3.13.0-5 (extra)
man-db 2.13.1-2 (core)
mariadb-libs 12.3.3-2 (extra)
mise-bin 2026.9.7-1 (omarchy)
mkinitcpio 41.1-1 (core)
moonlight-qt 6.1.0-7 (extra)
mpv 1:0.41.0-6 (extra)
mpv-mpris 1.2-2 (extra)
nautilus 50.3.1-1 (extra)
nautilus-python 4.1.0-3 (extra)
networkmanager 1.58.1-1 (extra)
noto-fonts 1:2026.09.01-1 (extra)
noto-fonts-cjk 20240730-1 (extra)
noto-fonts-emoji 1:2.051-1 (extra)
nss-mdns 0.15.1-2 (extra)
obsidian 1.13.7-2 (extra)
obs-studio 32.2.2-1 (extra)
omacalc 0.2.2-1 (omarchy)
omacut 0.4.0-1 (omarchy)
omarchy 4.0.4-1 (omarchy)
omarchy-keyring 20251027-1 (omarchy)
omarchy-nvim 2026.8.13-1 (omarchy)
omarchy-settings 4.0.4-1 (omarchy)
omawrite 0.5.0-1 (omarchy)
openbsd-netcat 1.238_1-1 (extra)
pacman-contrib 1.13.1-1 (extra)
pamixer 1.6-4 (extra)
pinta 3.1.2-1 (omarchy)
pinta 3.1.2-2 (extra)
pipewire 1:1.6.8-1 (extra)
pipewire-alsa 1:1.6.8-1 (extra)
pipewire-jack 1:1.6.8-1 (extra)
pipewire-pulse 1:1.6.8-1 (extra)
plocate 1.1.25-1 (extra)
postgresql-libs 18.6-1 (extra)
power-profiles-daemon 0.30-1 (extra)
python-gobject 3.56.3-1 (extra)
python-poetry-core 2.4.1-1 (extra)
qemu-user-static-binfmt 11.1.1-1 (extra)
qrencode 4.1.1-4 (extra)
qt6-imageformats 6.11.2-1 (extra)
quickshell 0.3.1-1 (extra)
ripgrep 15.2.0-1 (extra)
ruby 3.4.10-1 (extra)
sddm 0.21.0-7 (extra)
slurp 1.5.0-2 (extra)
socat 1.8.1.3-1 (extra)
starship 1.26.0-1 (extra)
sudo 1.9.17.p2-6 (core)
sushi 50.0-1 (extra)
system-config-printer 1.5.18-7 (extra)
t2fanrd r16.48baf96-1 (arch-mact2)
tensaku 0.29.0-1 (omarchy)
tesseract 5.5.3-1 (extra)
tesseract-data-eng 2:4.1.0-5 (extra)
thermald 2:2.5.12-1 (extra)
tldr 3.4.4-1 (extra)
tmux 3.7_c-1 (extra)
tobi-try 1.8.1-3 (omarchy)
tree-sitter-cli 0.26.9-1 (extra)
ttf-ia-writer 20181225-1 (omarchy)
ttf-jetbrains-mono-nerd-basic 3.5.1-1 (omarchy)
ttfx 0.3.2-1 (omarchy)
tzupdate 3.1.0-1 (omarchy)
udiskie 2.7.0-2 (extra)
ufw 0.36.2-7 (extra)
ufw-docker 251123-1 (omarchy)
usage 5.1.0-1 (extra)
uwsm 0.26.7-1 (extra)
voxtype-bin 1.0.1-1 (omarchy)
vpl-gpu-rt 26.2.4-1 (extra)
vulkan-asahi 1:26.2.2-1 (extra)
vulkan-intel 1:26.2.2-1 (extra)
vulkan-radeon 1:26.2.2-1 (extra)
whois 5.6.6-1 (extra)
wireless-regdb 2026.05.30-1 (core)
wireplumber 0.5.17-1 (extra)
wl-clipboard 1:2.3.0-1 (extra)
woff2-font-awesome 7.3.1-1 (extra)
wtype 0.4-2 (extra)
xdg-desktop-portal-gtk 1.15.3-1 (extra)
xdg-desktop-portal-hyprland 1.4.1-2 (extra)
xdg-terminal-exec 0.14.3-1 (omarchy)
xournalpp 1.3.7-1 (extra)
yaru-icon-theme 26.04.5.1ubuntu-1 (omarchy)
yay 13.0.1-1 (omarchy)
yt-dlp 2026.08.19-1 (extra)
zbar 0.23.93-7 (extra)
zoxide 0.10.0-1 (extra)
zram-generator 1.2.1-1 (extra)
View raw text
**What happened**
`omarchy windows vm launch` (and the desktop launcher) fails with a generic `❌ Failed to start Windows VM!` and no further detail. Docker is never even started — `dockerd` shows no activity during the failed attempt (confirmed via `journalctl`).
**Root cause**
The `~/Windows` shared-mount folder had the setgid bit set (`drwx--S---`, mode `2700`) instead of the expected `700`. `prepare_caller_mounts`/`assert_mounts_safe` in `omarchy-windows-vm` chmods the storage/shared folders with a numeric mode (`chmod 0700`) and then re-`stat`s them to verify the change, aborting if the mode doesn't match.
GNU `chmod` deliberately will not clear an existing setgid bit on a directory via a **numeric** mode — only a symbolic mode (`chmod g-s`) or setting it explicitly can. So the verification step in `prepare_caller_mounts` can never succeed once setgid is set on that folder, and the script exits before it ever touches Docker, with no error surfaced to the user (the desktop launcher has `Terminal=false`, so even the internal `>&2` messages, if any were printed, go nowhere visible).
Reproduced directly, outside the script:
```
$ chmod 2700 ~/Windows
$ chmod -v 0700 ~/Windows
mode of '/home/user/Windows' retained as 2700 (rwx--S---)
$ chmod g-s ~/Windows # this is the only thing that actually clears it
```
I don't know how the setgid bit got set on that folder in the first place — possibly inherited at creation time, or set by an earlier version of the installer — but regardless, the script's mount-safety check can get permanently stuck against it with no recovery path or diagnostic message.
**Fix**
In `omarchy-windows-vm`, replace the numeric `chmod 0700` (or whatever mode string is used) for the storage/shared boundary check with something that can actually clear setgid/setuid, e.g. `chmod u=rwx,go=` (symbolic) or `chmod g-s,u=rwx,go=` — and ideally print a clear error naming the exact directory and mode mismatch when `assert_mounts_safe` fails, instead of the generic "Failed to start Windows VM!".
**Workaround**
```
chmod g-s ~/Windows
```
**System details**
- Omarchy: 4.0.4-1
- Kernel: 7.2.6-arch2-Watanare-T2-1-t2
- Filesystem: btrfs (`/home` subvolume)
<details>
<summary>omarchy-debug --no-sudo --print output</summary>
```
Date: Wed Sep 16 02:08:44 PM EDT 2026
Hostname: omarchy
Omarchy Package: omarchy 4.0.4-1
=========================================
SYSTEM INFORMATION
=========================================
12System:
12Kernel 7.2.6-arch2-Watanare-T2-1-t2 12arch x86_64 12bits 64 12compiler gcc 12v 16.2.1 12clocksource tsc
12avail acpi_pm 12parameters cryptdevice=PARTUUID=53215a21-a225-44d2-a403-fd2663c686d2:root
root=/dev/mapper/root zswap.enabled=0 rootflags=subvol=@ rw rootfstype=btrfs intel_iommu=on
iommu=pt pm_async=off mem_sleep_default=deep resume=/dev/mapper/root resume_offset=1932693
initramfs_async=0 quiet splash loglevel=0 systemd.show_status=false rd.udev.log_level=0
vt.global_cursor_default=0
12Desktop Hyprland 12v 0.56.2 12vt 1 12dm SDDM 12Distro Omarchy
12Machine:
12Type Laptop 12System Apple 12product MacBookPro16,1 12v 1.0 12serial <superuser required> 12Chassis 12type 9
12v Mac-E1008331FDC96864 12serial <superuser required>
12Mobo Apple 12model Mac-E1008331FDC96864 12v MacBookPro16,1 12serial <superuser required>
12uuid <superuser required> 12Firmware UEFI 12vendor Apple 12v 2103.160.2.0.0 (iBridge: 24.16.6005.0.0,0)
12date 08/20/2026
12Battery:
12ID-1 BAT0 12charge 81.9 Wh (105.9%) 12note check 12condition 77.4/99.9 Wh (77.5%) 12temp 34.7 C
12volts 12.53 12min 11.36 12model DSY bq40z651 12type Li-ion 12serial N/A 12charging 12status full 12cycles 416
12CPU:
12Info 12model Intel Core i7-9750H 12bits 64 12type MT MCP 12arch Coffee Lake 12gen core 9 12level v3
12note check 12built 2018 12process Intel 14nm 12family 6 12model-id 0x9E (158) 12stepping 0xA (10)
12microcode 0xFA
12Topology 12cpus 1x 12dies 1 12clusters 6 12cores 6 12threads 12 12tpc 2 12smt enabled 12cache 12L1 384 KiB
12desc d-6x32 KiB; i-6x32 KiB 12L2 1.5 MiB 12desc 6x256 KiB 12L3 12 MiB 12desc 1x12 MiB
12Speed (MHz) 12avg 4090 12min/max 800/4500 12scaling 12driver intel_pstate 12governor powersave 12cores
121 4090 122 4090 123 4090 124 4090 125 4090 126 4090 127 4090 128 4090 129 4090 1210 4090 1211 4090 1212 4090
12bogomips 62399
12Flags-basic avx avx2 ht lm nx pae sse sse2 sse3 sse4_1 sse4_2 ssse3 vmx
12Vulnerabilities
12Type gather_data_sampling 12mitigation Microcode
12Type ghostwrite 12status Not affected
12Type indirect_target_selection 12status Not affected
12Type itlb_multihit 12status KVM: Split huge pages
12Type l1tf 12mitigation PTE Inversion; VMX: conditional cache flushes, SMT vulnerable
12Type mds 12mitigation Clear CPU buffers; SMT vulnerable
12Type meltdown 12mitigation PTI
12Type mmio_stale_data 12mitigation Clear CPU buffers; SMT vulnerable
12Type old_microcode 12status Not affected
12Type reg_file_data_sampling 12status Not affected
12Type retbleed 12mitigation IBRS
12Type spec_rstack_overflow 12status Not affected
12Type spec_store_bypass 12mitigation Speculative Store Bypass disabled via prctl
12Type spectre_v1 12mitigation usercopy/swapgs barriers and __user pointer sanitization
12Type spectre_v2 12mitigation IBRS; IBPB: conditional; STIBP: conditional; RSB filling;
PBRSB-eIBRS: Not affected; BHI: Not affected
12Type srbds 12mitigation Microcode
12Type tsa 12status Not affected
12Type tsx_async_abort 12status Not affected
12Type vmscape 12mitigation IBPB before exit to userspace
12Graphics:
12Device-1 Intel CoffeeLake-H GT2 [UHD Graphics 630] 12vendor Apple MacBookPro16 1 12driver i915
12v kernel 12arch Gen-9.5 12process Intel 14nm 12built 2016-20 12ports 12active eDP-1 12empty DP-1, DP-2,
DP-3, HDMI-A-1, HDMI-A-2, HDMI-A-3 12bus-ID 00:02.0 12chip-ID 8086:3e9b 12class-ID 0300
12Device-2 Advanced Micro Devices [AMD/ATI] Navi 14 [Radeon RX 5500/5500M / Pro 5300/5300M/5500M]
12vendor Apple 12driver amdgpu 12v kernel 12arch RDNA-1 12code Navi-1x 12process TSMC n7 (7nm) 12built 2019-20
12pcie 12gen 4 12speed 16 GT/s 12lanes 16 12ports 12active none 12off eDP-2 12empty DP-4, DP-5, DP-6, DP-7
12bus-ID 03:00.0 12chip-ID 1002:7340 12class-ID 0300
12Device-3 Apple FaceTime HD Camera (Built-in) 12driver uvcvideo 12type USB 12rev 2.0 12speed 480 Mb/s
12lanes 1 12mode 2.0 12bus-ID 9-2:7 12chip-ID 05ac:8514 12class-ID 0e02 12serial <filter>
12Display wayland 12server X.org 12v 1.21.1.24 12with Xwayland 12v 24.1.13 12compositor Hyprland 12v 0.56.2
12driver 12gpu amdgpu,i915 12display-ID 1 12note no compositor data
12Monitor-1 eDP-1 12model Apple Color LCD 12built 2019 12res 3072x1920 12dpi 226 12gamma 1.2
12size 345x215mm (13.58x8.46") 12diag 407mm (16") 12ratio 16:10 12modes 3072x1920
12Monitor-2 eDP-2 12size-res N/A 12modes N/A
12API EGL 12Message EGL data requires eglinfo. Check --recommends.
12Info 12Tools 12x11 xprop
12Audio:
12Device-1 Advanced Micro Devices [AMD/ATI] Navi 10 HDMI Audio 12driver snd_hda_intel 12v kernel 12pcie
12gen 4 12speed 16 GT/s 12lanes 16 12bus-ID 03:00.1 12chip-ID 1002:ab38 12class-ID 0403
12Device-2 Apple Audio 12driver t2bce_audio 12v 0.02 12pcie 12gen 3 12speed 8 GT/s 12lanes 4 12bus-ID 04:00.3
12chip-ID 106b:1803 12class-ID 0401
12API ALSA 12v k7.2.6-arch2-Watanare-T2-1-t2 12status kernel-api 12tools alsactl,alsamixer,amixer
12Server-1 sndiod 12v N/A 12status off 12tools aucat,midicat,sndioctl
12Server-2 PipeWire 12v 1.6.8 12status active 12with 121 pipewire-pulse 12status active 122 wireplumber
12status active 123 pipewire-alsa 12type plugin 124 pw-jack 12type plugin 12tools pactl,pw-cat,pw-cli,wpctl
12Network:
12Device-1 Broadcom BCM4364 802.11ac Wireless Network Adapter 12vendor Apple 12driver brcmfmac 12v kernel
12pcie 12gen 1 12speed 2.5 GT/s 12lanes 1 12bus-ID 05:00.0 12chip-ID 14e4:4464 12class-ID 0280
12IF wlp5s0 12state up 12mac <filter>
12IF-ID-1 br-aa29db787547 12state up 12speed 10000 Mbps 12duplex unknown 12mac <filter>
12IF-ID-2 docker0 12state down 12mac <filter>
12IF-ID-3 enp4s0f1u1 12state up 12speed 100 Mbps 12duplex unknown 12mac <filter>
12IF-ID-4 veth14ee03c 12state up 12speed 10000 Mbps 12duplex full 12mac <filter>
12Info 12services NetworkManager, nginx, smbd, systemd-timesyncd, wpa_supplicant
12Drives:
12Local Storage 12total 931.84 GiB 12used 50.22 GiB (5.4%)
12SMART Message Required tool smartctl not installed. Check --recommends
12ID-1 /dev/nvme0n1 12maj-min 259:0 12vendor Apple 12model SSD AP1024N 12size 931.84 GiB 12block-size
12physical 4096 B 12logical 4096 B 12speed 31.6 Gb/s 12lanes 4 12tech SSD 12serial <filter> 12fw-rev 1310
12temp 35.9 C 12scheme GPT
12Partition:
12ID-1 / 12raw-size 929.82 GiB 12size 929.82 GiB (100.00%) 12used 50.05 GiB (5.4%) 12fs btrfs 12dev /dev/dm-0
12maj-min 253:0 12mapped root
12ID-2 /boot 12raw-size 2 GiB 12size 2 GiB (99.80%) 12used 172 MiB (8.4%) 12fs vfat 12dev /dev/nvme0n1p1
12maj-min 259:1
12ID-3 /home 12raw-size 929.82 GiB 12size 929.82 GiB (100.00%) 12used 50.05 GiB (5.4%) 12fs btrfs
12dev /dev/dm-0 12maj-min 253:0 12mapped root
12ID-4 /var/log 12raw-size 929.82 GiB 12size 929.82 GiB (100.00%) 12used 50.05 GiB (5.4%) 12fs btrfs
12dev /dev/dm-0 12maj-min 253:0 12mapped root
12Swap:
12Kernel 12swappiness 150 (default 60) 12cache-pressure 50 (default 100) 12zswap no
12ID-1 swap-1 12type file 12size 15.51 GiB 12used 0 KiB (0.0%) 12priority 0 12file /swap/swapfile
12ID-2 swap-2 12type zram 12size 15.5 GiB 12used 0 KiB (0.0%) 12priority 100 12comp zstd
12avail lzo-rle,lzo,lz4,lz4hc,deflate,842 12dev /dev/zram0
12Sensors:
12System Temperatures 12cpu 65.0 C 12pch 61.0 C 12mobo N/A 12gpu amdgpu 12temp 63.0 C 12mem 0.0 C
12Fan Speeds (rpm) 12cpu 5443 12mobo 5059 12gpu amdgpu 12fan 0
12Repos:
12Packages 12pm pacman 12pkgs 965 12libs 271 12tools yay
12Active pacman repo servers in /etc/pacman.conf
121 https: //pkgs.omarchy.org/stable/$arch
122 https: //github.com/NoaHimesaka1873/arch-mact2-mirror/releases/download/release
12Active pacman repo servers in /etc/pacman.d/mirrorlist
121 https: //stable-mirror.omarchy.org/$repo/os/$arch
12Info:
12Memory 12total 16 GiB 12available 15.5 GiB 12used 11.67 GiB (75.3%)
12Processes 366 12Power 12uptime 23m 12states freeze,mem,disk 12suspend deep 12avail s2idle 12wakeups 0
12hibernate platform 12avail shutdown, reboot, suspend, test_resume 12image 6.07 GiB
12services power-profiles-daemon, thermald, upowerd 12Init systemd 12v 261 12default graphical
12tool systemctl
12Compilers 12clang 22.1.8 12gcc 16.2.1 12Client shell wrapper 12v 5.3.15-release 12inxi 3.3.41
=========================================
DMESG
=========================================
(skipped - --no-sudo flag used)
=========================================
JOURNALCTL (CURRENT BOOT, WARNINGS+ERRORS)
=========================================
Sep 16 13:45:38 omarchy kernel: x86/cpu: SGX disabled or unsupported by BIOS.
Sep 16 13:45:38 omarchy kernel: MDS CPU bug present and SMT on, data leak possible. See https://www.kernel.org/doc/html/latest/admin-guide/hw-vuln/mds.html for more details.
Sep 16 13:45:38 omarchy kernel: MMIO Stale Data CPU bug present and SMT on, data leak possible. See https://www.kernel.org/doc/html/latest/admin-guide/hw-vuln/processor_mmio_stale_data.html for more details.
Sep 16 13:45:38 omarchy kernel: VMSCAPE: SMT on, STIBP is required for full protection. See https://www.kernel.org/doc/html/latest/admin-guide/hw-vuln/vmscape.html for more details.
Sep 16 13:45:38 omarchy kernel: virt/tdx: TDX not supported by the host platform
Sep 16 13:45:38 omarchy kernel: ACPI Error: AE_ALREADY_EXISTS, SSDT 0xFFFF8C31C19D2C00 Table is already loaded (20260408/tbdata-548)
Sep 16 13:45:38 omarchy kernel: ACPI Error: Aborting method \_PR.CPU0.GCAP due to previous error (AE_ALREADY_EXISTS) (20260408/psparse-543)
Sep 16 13:45:38 omarchy kernel: ACPI Error: Aborting method \_PR.CPU0._OSC due to previous error (AE_ALREADY_EXISTS) (20260408/psparse-543)
Sep 16 13:45:38 omarchy kernel: ACPI Error: AE_ALREADY_EXISTS, SSDT 0xFFFF8C31C1085000 Table is already loaded (20260408/tbdata-548)
Sep 16 13:45:38 omarchy kernel: ACPI Error: Aborting method \_PR.CPU0.GCAP due to previous error (AE_ALREADY_EXISTS) (20260408/psparse-543)
Sep 16 13:45:38 omarchy kernel: ACPI Error: Aborting method \_PR.CPU0._PDC due to previous error (AE_ALREADY_EXISTS) (20260408/psparse-543)
Sep 16 13:45:38 omarchy kernel: ACPI Error: AE_ALREADY_EXISTS, SSDT 0xFFFF8C31C1081800 Table is already loaded (20260408/tbdata-548)
Sep 16 13:45:38 omarchy kernel: ACPI Error: Aborting method \_PR.CPU1.APPT due to previous error (AE_ALREADY_EXISTS) (20260408/psparse-543)
Sep 16 13:45:38 omarchy kernel: ACPI Error: Aborting method \_PR.CPU1.GCAP due to previous error (AE_ALREADY_EXISTS) (20260408/psparse-543)
Sep 16 13:45:38 omarchy kernel: ACPI Error: Aborting method \_PR.CPU1._PDC due to previous error (AE_ALREADY_EXISTS) (20260408/psparse-543)
Sep 16 13:45:38 omarchy kernel: ACPI Error: AE_ALREADY_EXISTS, SSDT 0xFFFF8C31C19D2C00 Table is already loaded (20260408/tbdata-548)
Sep 16 13:45:38 omarchy kernel: ACPI Error: Aborting method \_PR.CPU1.APCT due to previous error (AE_ALREADY_EXISTS) (20260408/psparse-543)
Sep 16 13:45:38 omarchy kernel: ACPI Error: Aborting method \_PR.CPU2.GCAP due to previous error (AE_ALREADY_EXISTS) (20260408/psparse-543)
Sep 16 13:45:38 omarchy kernel: ACPI Error: Aborting method \_PR.CPU2._PDC due to previous error (AE_ALREADY_EXISTS) (20260408/psparse-543)
Sep 16 13:45:38 omarchy kernel: ERROR: Unable to locate IOAPIC for GSI 34
Sep 16 13:45:38 omarchy kernel: ENERGY_PERF_BIAS: Set to 'normal', was 'performance'
Sep 16 13:45:38 omarchy kernel: integrity: Reading UEFI Secure Boot Certs is not supported on T2 Macs.
Sep 16 13:45:38 omarchy kernel: t2bce_dma: module is from the staging directory, the quality is unknown, you have been warned.
Sep 16 13:45:38 omarchy kernel: t2bce_core: module is from the staging directory, the quality is unknown, you have been warned.
Sep 16 13:45:38 omarchy kernel: t2bce_vhci: module is from the staging directory, the quality is unknown, you have been warned.
Sep 16 13:45:38 omarchy kernel: thunderbolt 0000:08:00.0: device links to tunneled native ports are missing!
Sep 16 13:45:38 omarchy kernel: thunderbolt 0000:7e:00.0: device links to tunneled native ports are missing!
Sep 16 13:45:38 omarchy kernel: intel-lpss INT34BA:00: error -EINVAL: IRQ index 0 not found
Sep 16 13:45:38 omarchy kernel: intel-lpss INT34BA:00: probe with driver intel-lpss failed with error -22
Sep 16 13:45:38 omarchy kernel: pci 0000:00:02.0: deferred probe pending: (reason unknown)
Sep 16 13:45:38 omarchy kernel: pci 0000:03:00.0: deferred probe pending: (reason unknown)
Sep 16 13:45:39 omarchy kernel: intel_pch_thermal 0000:00:12.0: can't derive routing for PCI INT A
Sep 16 13:45:39 omarchy kernel: intel_pch_thermal 0000:00:12.0: PCI INT A: not connected
Sep 16 13:45:39 omarchy kernel: t2bce_audio: module is from the staging directory, the quality is unknown, you have been warned.
Sep 16 13:45:39 omarchy kernel: hci_uart_bcm serial0-0: Unexpected ACPI gpio_int_idx: -1
Sep 16 13:45:39 omarchy kernel: hci_uart_bcm serial0-0: Unexpected number of ACPI GPIOs: 0
Sep 16 13:45:39 omarchy kernel: hci_uart_bcm serial0-0: No reset resource, using default baud rate
Sep 16 13:45:39 omarchy kernel: uvcvideo 5-1.4.4:1.1: Failed to set UVC probe control : -32 (exp. 26).
Sep 16 13:45:39 omarchy kernel: spi-nor spi0.0: supply vcc not found, using dummy regulator
Sep 16 13:45:39 omarchy kernel: spi-nor spi0.0: unrecognized JEDEC id bytes: f4 0c 58 12 03 00
Sep 16 13:45:39 omarchy kernel: applesmc APP0001:00: hwmon_device_register() is deprecated. Please convert the driver to use hwmon_device_register_with_info().
Sep 16 13:45:39 omarchy kernel: hid-sensor-hub 0003:05AC:8104.0009: No report with id 0xffffffff found
Sep 16 13:45:39 omarchy kernel: hid_sensor_rotation HID-SENSOR-20008a.1.auto: failed to setup common attributes
Sep 16 13:45:39 omarchy kernel: hid_sensor_rotation HID-SENSOR-20008a.1.auto: probe with driver hid_sensor_rotation failed with error -22
Sep 16 13:45:39 omarchy kernel: brcmfmac: brcmf_fw_alloc_request: using brcm/brcmfmac4364b3-pcie for chip BCM4364/4
Sep 16 13:45:39 omarchy kernel: Bluetooth: hci0: BCM: failed to write update baudrate (-16)
Sep 16 13:45:39 omarchy kernel: Bluetooth: hci0: Failed to set baudrate
Sep 16 13:45:39 omarchy kernel: Bluetooth: hci0: BCM: firmware Patch file not found, tried:
Sep 16 13:45:39 omarchy kernel: Bluetooth: hci0: BCM: 'brcm/BCM.hcd'
Sep 16 13:45:39 omarchy kernel: Bluetooth: hci0: HCI Read Transmit Power Level command is advertised, but not supported.
Sep 16 13:45:40 omarchy kernel: brcmfmac: brcmf_c_process_txcap_blob: TxCap blob found, loading
Sep 16 13:45:40 omarchy kernel: brcmfmac: brcmf_c_preinit_dcmds: Firmware: BCM4364/4 wl0: Jul 10 2023 12:53:18 version 9.30.503.0.32.5.92 FWID 01-c06f991b
Sep 16 13:45:41 omarchy kernel: workqueue: name exceeds WQ_NAME_LEN. Truncating to: hdmi_frl_status_polling_workque
Sep 16 13:45:41 omarchy wpa_supplicant[998]: wlp5s0: nl80211: kernel reports: multicast RX registrations are not supported
Sep 16 13:45:42 omarchy kernel: ieee80211 phy0: brcmf_p2p_set_firmware: failed to update device address ret -52
Sep 16 13:45:42 omarchy wpa_supplicant[998]: Failed to create interface p2p-dev-wlp5s0: -52 (Invalid exchange)
Sep 16 13:45:42 omarchy kernel: ieee80211 phy0: brcmf_p2p_create_p2pdev: set p2p_disc error
Sep 16 13:45:42 omarchy kernel: ieee80211 phy0: brcmf_cfg80211_add_iface: add iface p2p-dev-wlp5s0 type 10 failed: err=-52
Sep 16 13:45:42 omarchy wpa_supplicant[998]: nl80211: Failed to create a P2P/NAN Device interface p2p-dev-wlp5s0
Sep 16 13:45:42 omarchy NetworkManager[897]: <warn> [1789580742.0636] device (p2p-dev-wlp5s0): error setting IPv4 forwarding to '0': Resource temporarily unavailable
Sep 16 13:45:42 omarchy sddm-helper[1019]: gkr-pam: no password is available for user
Sep 16 13:45:42 omarchy dbus-broker-launch[895]: Activation request for 'org.freedesktop.home1' failed: The systemd unit 'dbus-org.freedesktop.home1.service' could not be found.
Sep 16 13:45:42 omarchy sddm-helper[1019]: gkr-pam: couldn't unlock the login keyring.
Sep 16 13:45:42 omarchy pipewire[1040]: mod.rt: RTKit error: org.freedesktop.DBus.Error.ServiceUnknown
Sep 16 13:45:42 omarchy pipewire[1040]: mod.rt: RTKit does not give us MaxRealtimePriority, using 1
Sep 16 13:45:42 omarchy pipewire-pulse[1043]: mod.rt: RTKit error: org.freedesktop.DBus.Error.ServiceUnknown
Sep 16 13:45:42 omarchy pipewire-pulse[1043]: mod.rt: RTKit does not give us MaxRealtimePriority, using 1
Sep 16 13:45:42 omarchy pipewire[1040]: mod.rt: RTKit error: org.freedesktop.DBus.Error.ServiceUnknown
Sep 16 13:45:42 omarchy pipewire[1040]: mod.rt: RTKit does not give us MinNiceLevel, using 0
Sep 16 13:45:42 omarchy pipewire-pulse[1043]: mod.rt: RTKit error: org.freedesktop.DBus.Error.ServiceUnknown
Sep 16 13:45:42 omarchy pipewire-pulse[1043]: mod.rt: RTKit does not give us MinNiceLevel, using 0
Sep 16 13:45:42 omarchy pipewire[1040]: mod.rt: RTKit error: org.freedesktop.DBus.Error.ServiceUnknown
Sep 16 13:45:42 omarchy pipewire[1040]: mod.rt: RTKit does not give us RTTimeUSecMax, using -1
Sep 16 13:45:42 omarchy pipewire-pulse[1043]: mod.rt: RTKit error: org.freedesktop.DBus.Error.ServiceUnknown
Sep 16 13:45:42 omarchy pipewire-pulse[1043]: mod.rt: RTKit does not give us RTTimeUSecMax, using -1
Sep 16 13:45:42 omarchy wireplumber[1041]: mod.rt: RTKit error: org.freedesktop.DBus.Error.ServiceUnknown
Sep 16 13:45:42 omarchy wireplumber[1041]: mod.rt: RTKit does not give us MaxRealtimePriority, using 1
Sep 16 13:45:42 omarchy wireplumber[1041]: mod.rt: RTKit error: org.freedesktop.DBus.Error.ServiceUnknown
Sep 16 13:45:42 omarchy wireplumber[1041]: mod.rt: RTKit does not give us MinNiceLevel, using 0
Sep 16 13:45:42 omarchy wireplumber[1041]: mod.rt: RTKit error: org.freedesktop.DBus.Error.ServiceUnknown
Sep 16 13:45:42 omarchy wireplumber[1041]: mod.rt: RTKit does not give us RTTimeUSecMax, using -1
Sep 16 13:45:42 omarchy wireplumber[1041]: mod.rt: RTKit error: org.freedesktop.DBus.Error.ServiceUnknown
Sep 16 13:45:42 omarchy wireplumber[1041]: mod.rt: RTKit does not give us MaxRealtimePriority, using 1
Sep 16 13:45:42 omarchy wireplumber[1041]: mod.rt: RTKit error: org.freedesktop.DBus.Error.ServiceUnknown
Sep 16 13:45:42 omarchy wireplumber[1041]: mod.rt: RTKit does not give us MinNiceLevel, using 0
Sep 16 13:45:42 omarchy wireplumber[1041]: mod.rt: RTKit error: org.freedesktop.DBus.Error.ServiceUnknown
Sep 16 13:45:42 omarchy wireplumber[1041]: mod.rt: RTKit does not give us RTTimeUSecMax, using -1
Sep 16 13:45:42 omarchy wireplumber[1041]: default: Failed to get percentage from UPower: org.freedesktop.DBus.Error.NameHasNoOwner
Sep 16 13:45:45 omarchy kernel: [drm:dm_helpers_read_local_edid [amdgpu]] *ERROR* EDID err: 2, on connector: eDP-2
Sep 16 13:45:45 omarchy kernel: amdgpu 0000:03:00.0: [drm] *ERROR* No EDID read.
Sep 16 13:45:45 omarchy wpa_supplicant[998]: wlp5s0: nl80211: kernel reports: multicast RX registrations are not supported
Sep 16 13:45:46 omarchy kernel: amdgpu 0000:03:00.0: Fence fallback timer expired on ring sdma0
Sep 16 13:45:46 omarchy kernel: amdgpu 0000:03:00.0: Fence fallback timer expired on ring sdma0
Sep 16 13:45:46 omarchy kernel: amdgpu 0000:03:00.0: [drm] Adding stream 0000000047449c5a to context failed with err 28!
Sep 16 13:45:46 omarchy kernel: amdgpu 0000:03:00.0: [drm] Adding stream 0000000047449c5a to context failed with err 28!
Sep 16 13:45:46 omarchy kernel: amdgpu 0000:03:00.0: [drm] Adding stream 0000000047449c5a to context failed with err 28!
Sep 16 13:45:46 omarchy kernel: amdgpu 0000:03:00.0: [drm] Adding stream 0000000047449c5a to context failed with err 28!
Sep 16 13:45:46 omarchy kernel: amdgpu 0000:03:00.0: [drm] Adding stream 0000000047449c5a to context failed with err 28!
Sep 16 13:45:46 omarchy kernel: amdgpu 0000:03:00.0: [drm] Adding stream 0000000047449c5a to context failed with err 28!
Sep 16 13:45:46 omarchy kernel: amdgpu 0000:03:00.0: [drm] Adding stream 00000000634d94b7 to context failed with err 28!
Sep 16 13:45:46 omarchy kernel: amdgpu 0000:03:00.0: [drm] Adding stream 00000000634d94b7 to context failed with err 28!
Sep 16 13:45:46 omarchy kernel: amdgpu 0000:03:00.0: [drm] Adding stream 00000000634d94b7 to context failed with err 28!
Sep 16 13:45:46 omarchy kernel: amdgpu 0000:03:00.0: [drm] Adding stream 00000000634d94b7 to context failed with err 28!
Sep 16 13:45:46 omarchy kernel: amdgpu 0000:03:00.0: [drm] Adding stream 00000000634d94b7 to context failed with err 28!
Sep 16 13:45:46 omarchy kernel: amdgpu 0000:03:00.0: [drm] Adding stream 00000000634d94b7 to context failed with err 28!
Sep 16 13:45:46 omarchy kernel: amdgpu 0000:03:00.0: [drm] Adding stream 00000000634d94b7 to context failed with err 28!
Sep 16 13:45:46 omarchy kernel: amdgpu 0000:03:00.0: [drm] Adding stream 00000000634d94b7 to context failed with err 28!
Sep 16 13:45:46 omarchy kernel: amdgpu 0000:03:00.0: [drm] Adding stream 00000000634d94b7 to context failed with err 28!
Sep 16 13:45:46 omarchy kernel: amdgpu 0000:03:00.0: [drm] Adding stream 00000000634d94b7 to context failed with err 28!
Sep 16 13:45:46 omarchy kernel: amdgpu 0000:03:00.0: [drm] Adding stream 00000000634d94b7 to context failed with err 28!
Sep 16 13:45:46 omarchy kernel: amdgpu 0000:03:00.0: [drm] Adding stream 00000000634d94b7 to context failed with err 28!
Sep 16 13:45:46 omarchy kernel: amdgpu 0000:03:00.0: [drm] Adding stream 00000000b4b4c05d to context failed with err 28!
Sep 16 13:45:46 omarchy kernel: amdgpu 0000:03:00.0: [drm] Adding stream 00000000b4b4c05d to context failed with err 28!
Sep 16 13:45:46 omarchy kernel: amdgpu 0000:03:00.0: [drm] Adding stream 00000000b4b4c05d to context failed with err 28!
Sep 16 13:45:46 omarchy kernel: amdgpu 0000:03:00.0: [drm] Adding stream 00000000b4b4c05d to context failed with err 28!
Sep 16 13:45:46 omarchy kernel: amdgpu 0000:03:00.0: [drm] Adding stream 00000000b4b4c05d to context failed with err 28!
Sep 16 13:45:46 omarchy kernel: amdgpu 0000:03:00.0: [drm] Adding stream 00000000b4b4c05d to context failed with err 28!
Sep 16 13:45:46 omarchy kernel: amdgpu 0000:03:00.0: [drm] Adding stream 00000000b4b4c05d to context failed with err 28!
Sep 16 13:45:46 omarchy kernel: amdgpu 0000:03:00.0: [drm] Adding stream 00000000b4b4c05d to context failed with err 28!
Sep 16 13:45:46 omarchy kernel: amdgpu 0000:03:00.0: [drm] Adding stream 00000000b4b4c05d to context failed with err 28!
Sep 16 13:45:46 omarchy kernel: amdgpu 0000:03:00.0: [drm] Adding stream 00000000b4b4c05d to context failed with err 28!
Sep 16 13:45:46 omarchy kernel: amdgpu 0000:03:00.0: [drm] Adding stream 00000000b4b4c05d to context failed with err 28!
Sep 16 13:45:46 omarchy kernel: amdgpu 0000:03:00.0: [drm] Adding stream 00000000b4b4c05d to context failed with err 28!
Sep 16 13:45:46 omarchy kernel: amdgpu 0000:03:00.0: [drm] Adding stream 00000000b4b4c05d to context failed with err 28!
Sep 16 13:45:46 omarchy kernel: amdgpu 0000:03:00.0: [drm] Adding stream 00000000b4b4c05d to context failed with err 28!
Sep 16 13:45:46 omarchy kernel: amdgpu 0000:03:00.0: [drm] Adding stream 00000000b4b4c05d to context failed with err 28!
Sep 16 13:45:46 omarchy kernel: amdgpu 0000:03:00.0: [drm] Adding stream 00000000b4b4c05d to context failed with err 28!
Sep 16 13:45:46 omarchy kernel: amdgpu 0000:03:00.0: [drm] Adding stream 00000000b4b4c05d to context failed with err 28!
Sep 16 13:45:46 omarchy kernel: amdgpu 0000:03:00.0: [drm] Adding stream 00000000b4b4c05d to context failed with err 28!
Sep 16 13:45:46 omarchy kernel: amdgpu 0000:03:00.0: [drm] Adding stream 00000000b4b4c05d to context failed with err 28!
Sep 16 13:45:46 omarchy kernel: amdgpu 0000:03:00.0: [drm] Adding stream 00000000b4b4c05d to context failed with err 28!
Sep 16 13:45:46 omarchy kernel: amdgpu 0000:03:00.0: [drm] Adding stream 00000000b4b4c05d to context failed with err 28!
Sep 16 13:45:46 omarchy kernel: amdgpu 0000:03:00.0: [drm] Adding stream 00000000b4b4c05d to context failed with err 28!
Sep 16 13:45:46 omarchy kernel: amdgpu 0000:03:00.0: [drm] Adding stream 00000000b4b4c05d to context failed with err 28!
Sep 16 13:45:46 omarchy kernel: amdgpu 0000:03:00.0: [drm] Adding stream 00000000b4b4c05d to context failed with err 28!
Sep 16 13:45:46 omarchy kernel: amdgpu 0000:03:00.0: [drm] Adding stream 00000000b4b4c05d to context failed with err 28!
Sep 16 13:45:46 omarchy kernel: amdgpu 0000:03:00.0: [drm] Adding stream 00000000b4b4c05d to context failed with err 28!
Sep 16 13:45:46 omarchy kernel: amdgpu 0000:03:00.0: [drm] Adding stream 00000000b4b4c05d to context failed with err 28!
Sep 16 13:45:46 omarchy kernel: amdgpu 0000:03:00.0: [drm] Adding stream 00000000b4b4c05d to context failed with err 28!
Sep 16 13:45:46 omarchy kernel: amdgpu 0000:03:00.0: [drm] Adding stream 00000000b4b4c05d to context failed with err 28!
Sep 16 13:45:46 omarchy kernel: amdgpu 0000:03:00.0: [drm] Adding stream 00000000b4b4c05d to context failed with err 28!
Sep 16 13:45:46 omarchy dbus-broker[896]: A security policy denied :1.36 to send method call /org/freedesktop/DBus:org.freedesktop.DBus.Monitoring.BecomeMonitor to org.freedesktop.DBus.
Sep 16 13:45:46 omarchy /usr/lib/xdg-desktop-portal[1418]: Failed to load RealtimeKit property: GDBus.Error:org.freedesktop.DBus.Error.ServiceUnknown: The name is not activatable
Sep 16 13:45:46 omarchy /usr/lib/xdg-desktop-portal[1418]: Failed to load RealtimeKit property: GDBus.Error:org.freedesktop.DBus.Error.ServiceUnknown: The name is not activatable
Sep 16 13:45:46 omarchy /usr/lib/xdg-desktop-portal[1418]: Failed to load RealtimeKit property: GDBus.Error:org.freedesktop.DBus.Error.ServiceUnknown: The name is not activatable
Sep 16 13:45:48 omarchy kernel: [UFW BLOCK] IN=enp130s0u1u3u3 OUT= MAC=01:00:5e:00:00:01:a0:ad:9f:39:ef:00:08:00 SRC=192.168.50.1 DST=224.0.0.1 LEN=36 TOS=0x00 PREC=0x00 TTL=1 ID=44541 DF PROTO=2
Sep 16 13:45:48 omarchy kernel: [UFW BLOCK] IN=wlp5s0 OUT= MAC=01:00:5e:00:00:01:a0:ad:9f:39:ef:00:08:00 SRC=192.168.50.1 DST=224.0.0.1 LEN=36 TOS=0x00 PREC=0x00 TTL=1 ID=44541 DF PROTO=2
Sep 16 13:46:08 omarchy kernel: [UFW BLOCK] IN=enp130s0u1u3u3 OUT= MAC=01:00:5e:00:00:01:a0:ad:9f:39:ef:00:08:00 SRC=192.168.50.1 DST=224.0.0.1 LEN=36 TOS=0x00 PREC=0x00 TTL=1 ID=46937 DF PROTO=2
Sep 16 13:46:08 omarchy kernel: [UFW BLOCK] IN=wlp5s0 OUT= MAC=01:00:5e:00:00:01:a0:ad:9f:39:ef:00:08:00 SRC=192.168.50.1 DST=224.0.0.1 LEN=36 TOS=0x00 PREC=0x00 TTL=1 ID=46937 DF PROTO=2
Sep 16 13:46:13 omarchy kernel: [UFW BLOCK] IN=enp130s0u1u3u3 OUT= MAC=34:99:71:e1:92:9c:a0:ad:9f:39:ef:00:08:00 SRC=104.18.6.94 DST=192.168.50.81 LEN=95 TOS=0x00 PREC=0x00 TTL=57 ID=52673 DF PROTO=TCP SPT=443 DPT=52487 WINDOW=16 RES=0x00 ACK PSH URGP=0
Sep 16 13:46:14 omarchy kernel: [UFW BLOCK] IN=enp130s0u1u3u3 OUT= MAC=34:99:71:e1:92:9c:a0:ad:9f:39:ef:00:08:00 SRC=160.79.104.10 DST=192.168.50.81 LEN=105 TOS=0x00 PREC=0x00 TTL=55 ID=7548 DF PROTO=TCP SPT=443 DPT=51904 WINDOW=78 RES=0x00 ACK PSH URGP=0
Sep 16 13:46:28 omarchy NetworkManager[897]: <warn> [1789580788.6280] device (enp4s0f1u1): Activation: failed for connection 'Wired connection 2'
Sep 16 13:46:30 omarchy kernel: [UFW BLOCK] IN=enp130s0u1u3u3 OUT= MAC=01:00:5e:00:00:01:a0:ad:9f:39:ef:00:08:00 SRC=192.168.50.1 DST=224.0.0.1 LEN=36 TOS=0x00 PREC=0x00 TTL=1 ID=56272 DF PROTO=2
Sep 16 13:46:30 omarchy kernel: [UFW BLOCK] IN=wlp5s0 OUT= MAC=01:00:5e:00:00:01:a0:ad:9f:39:ef:00:08:00 SRC=192.168.50.1 DST=224.0.0.1 LEN=36 TOS=0x00 PREC=0x00 TTL=1 ID=56272 DF PROTO=2
Sep 16 13:46:50 omarchy kernel: [UFW BLOCK] IN=enp130s0u1u3u3 OUT= MAC=01:00:5e:00:00:01:a0:ad:9f:39:ef:00:08:00 SRC=192.168.50.1 DST=224.0.0.1 LEN=36 TOS=0x00 PREC=0x00 TTL=1 ID=2738 DF PROTO=2
Sep 16 13:46:50 omarchy kernel: [UFW BLOCK] IN=wlp5s0 OUT= MAC=01:00:5e:00:00:01:a0:ad:9f:39:ef:00:08:00 SRC=192.168.50.1 DST=224.0.0.1 LEN=36 TOS=0x00 PREC=0x00 TTL=1 ID=2738 DF PROTO=2
Sep 16 13:47:10 omarchy kernel: [UFW BLOCK] IN=enp130s0u1u3u3 OUT= MAC=01:00:5e:00:00:01:a0:ad:9f:39:ef:00:08:00 SRC=192.168.50.1 DST=224.0.0.1 LEN=36 TOS=0x00 PREC=0x00 TTL=1 ID=14358 DF PROTO=2
Sep 16 13:47:10 omarchy kernel: [UFW BLOCK] IN=wlp5s0 OUT= MAC=01:00:5e:00:00:01:a0:ad:9f:39:ef:00:08:00 SRC=192.168.50.1 DST=224.0.0.1 LEN=36 TOS=0x00 PREC=0x00 TTL=1 ID=14358 DF PROTO=2
Sep 16 13:47:10 omarchy NetworkManager[897]: <warn> [1789580830.9880] dns-sd-resolved[fe87d5de75da6be4]: send-updates SetLinkDomains@2 failed: GDBus.Error:org.freedesktop.resolve1.NoSuchLink: Link 2 not known
Sep 16 13:47:11 omarchy wireplumber[1041]: spa.alsa: 0x55a7f06fe128: poll fd error/hangup (card removed?), removing poll sources
Sep 16 13:47:13 omarchy NetworkManager[897]: <warn> [1789580833.6247] device (enp4s0f1u1): Activation: failed for connection 'Wired connection 2'
Sep 16 13:47:30 omarchy kernel: [UFW BLOCK] IN=wlp5s0 OUT= MAC=01:00:5e:00:00:01:a0:ad:9f:39:ef:00:08:00 SRC=192.168.50.1 DST=224.0.0.1 LEN=36 TOS=0x00 PREC=0x00 TTL=1 ID=23580 DF PROTO=2
Sep 16 13:47:49 omarchy kernel: workqueue: work func appletb_inactivity_work [hid_appletb_kbd] enqueued on deprecated workqueue. Use system_{percpu|dfl}_wq instead.
Sep 16 13:47:50 omarchy kernel: [UFW BLOCK] IN=wlp5s0 OUT= MAC=01:00:5e:00:00:01:a0:ad:9f:39:ef:00:08:00 SRC=192.168.50.1 DST=224.0.0.1 LEN=36 TOS=0x00 PREC=0x00 TTL=1 ID=24411 DF PROTO=2
Sep 16 13:47:58 omarchy NetworkManager[897]: <warn> [1789580878.6245] device (enp4s0f1u1): Activation: failed for connection 'Wired connection 2'
Sep 16 13:48:10 omarchy kernel: [UFW BLOCK] IN=wlp5s0 OUT= MAC=01:00:5e:00:00:01:a0:ad:9f:39:ef:00:08:00 SRC=192.168.50.1 DST=224.0.0.1 LEN=36 TOS=0x00 PREC=0x00 TTL=1 ID=34881 DF PROTO=2
Sep 16 13:48:30 omarchy kernel: [UFW BLOCK] IN=wlp5s0 OUT= MAC=01:00:5e:00:00:01:a0:ad:9f:39:ef:00:08:00 SRC=192.168.50.1 DST=224.0.0.1 LEN=36 TOS=0x00 PREC=0x00 TTL=1 ID=36942 DF PROTO=2
Sep 16 13:48:43 omarchy NetworkManager[897]: <warn> [1789580923.6251] device (enp4s0f1u1): Activation: failed for connection 'Wired connection 2'
Sep 16 13:48:50 omarchy kernel: [UFW BLOCK] IN=wlp5s0 OUT= MAC=01:00:5e:00:00:01:a0:ad:9f:39:ef:00:08:00 SRC=192.168.50.1 DST=224.0.0.1 LEN=36 TOS=0x00 PREC=0x00 TTL=1 ID=54540 DF PROTO=2
Sep 16 13:48:55 omarchy kernel: amdgpu 0000:03:00.0: Got zero output on CG_TACH_STATUS reading!
Sep 16 13:49:10 omarchy kernel: [UFW BLOCK] IN=wlp5s0 OUT= MAC=01:00:5e:00:00:01:a0:ad:9f:39:ef:00:08:00 SRC=192.168.50.1 DST=224.0.0.1 LEN=36 TOS=0x00 PREC=0x00 TTL=1 ID=7724 DF PROTO=2
Sep 16 13:49:30 omarchy kernel: [UFW BLOCK] IN=wlp5s0 OUT= MAC=01:00:5e:00:00:01:a0:ad:9f:39:ef:00:08:00 SRC=192.168.50.1 DST=224.0.0.1 LEN=36 TOS=0x00 PREC=0x00 TTL=1 ID=22627 DF PROTO=2
Sep 16 13:49:50 omarchy kernel: [UFW BLOCK] IN=wlp5s0 OUT= MAC=01:00:5e:00:00:01:a0:ad:9f:39:ef:00:08:00 SRC=192.168.50.1 DST=224.0.0.1 LEN=36 TOS=0x00 PREC=0x00 TTL=1 ID=24738 DF PROTO=2
Sep 16 13:50:10 omarchy kernel: [UFW BLOCK] IN=wlp5s0 OUT= MAC=01:00:5e:00:00:01:a0:ad:9f:39:ef:00:08:00 SRC=192.168.50.1 DST=224.0.0.1 LEN=36 TOS=0x00 PREC=0x00 TTL=1 ID=41016 DF PROTO=2
Sep 16 13:50:50 omarchy kernel: [UFW BLOCK] IN=wlp5s0 OUT= MAC=01:00:5e:00:00:01:a0:ad:9f:39:ef:00:08:00 SRC=192.168.50.1 DST=224.0.0.1 LEN=36 TOS=0x00 PREC=0x00 TTL=1 ID=59157 DF PROTO=2
Sep 16 13:51:10 omarchy kernel: [UFW BLOCK] IN=wlp5s0 OUT= MAC=01:00:5e:00:00:01:a0:ad:9f:39:ef:00:08:00 SRC=192.168.50.1 DST=224.0.0.1 LEN=36 TOS=0x00 PREC=0x00 TTL=1 ID=1268 DF PROTO=2
Sep 16 13:51:30 omarchy kernel: [UFW BLOCK] IN=wlp5s0 OUT= MAC=01:00:5e:00:00:01:a0:ad:9f:39:ef:00:08:00 SRC=192.168.50.1 DST=224.0.0.1 LEN=36 TOS=0x00 PREC=0x00 TTL=1 ID=11919 DF PROTO=2
Sep 16 13:51:50 omarchy kernel: [UFW BLOCK] IN=wlp5s0 OUT= MAC=01:00:5e:00:00:01:a0:ad:9f:39:ef:00:08:00 SRC=192.168.50.1 DST=224.0.0.1 LEN=36 TOS=0x00 PREC=0x00 TTL=1 ID=17123 DF PROTO=2
Sep 16 13:52:10 omarchy kernel: [UFW BLOCK] IN=wlp5s0 OUT= MAC=01:00:5e:00:00:01:a0:ad:9f:39:ef:00:08:00 SRC=192.168.50.1 DST=224.0.0.1 LEN=36 TOS=0x00 PREC=0x00 TTL=1 ID=30072 DF PROTO=2
Sep 16 13:52:30 omarchy kernel: [UFW BLOCK] IN=wlp5s0 OUT= MAC=01:00:5e:00:00:01:a0:ad:9f:39:ef:00:08:00 SRC=192.168.50.1 DST=224.0.0.1 LEN=36 TOS=0x00 PREC=0x00 TTL=1 ID=37772 DF PROTO=2
Sep 16 13:52:50 omarchy kernel: [UFW BLOCK] IN=wlp5s0 OUT= MAC=01:00:5e:00:00:01:a0:ad:9f:39:ef:00:08:00 SRC=192.168.50.1 DST=224.0.0.1 LEN=36 TOS=0x00 PREC=0x00 TTL=1 ID=49768 DF PROTO=2
Sep 16 13:53:10 omarchy kernel: [UFW BLOCK] IN=wlp5s0 OUT= MAC=01:00:5e:00:00:01:a0:ad:9f:39:ef:00:08:00 SRC=192.168.50.1 DST=224.0.0.1 LEN=36 TOS=0x00 PREC=0x00 TTL=1 ID=60335 DF PROTO=2
Sep 16 13:53:30 omarchy kernel: [UFW BLOCK] IN=wlp5s0 OUT= MAC=01:00:5e:00:00:01:a0:ad:9f:39:ef:00:08:00 SRC=192.168.50.1 DST=224.0.0.1 LEN=36 TOS=0x00 PREC=0x00 TTL=1 ID=7321 DF PROTO=2
Sep 16 13:53:50 omarchy kernel: [UFW BLOCK] IN=wlp5s0 OUT= MAC=01:00:5e:00:00:01:a0:ad:9f:39:ef:00:08:00 SRC=192.168.50.1 DST=224.0.0.1 LEN=36 TOS=0x00 PREC=0x00 TTL=1 ID=9321 DF PROTO=2
Sep 16 13:54:10 omarchy kernel: [UFW BLOCK] IN=wlp5s0 OUT= MAC=01:00:5e:00:00:01:a0:ad:9f:39:ef:00:08:00 SRC=192.168.50.1 DST=224.0.0.1 LEN=36 TOS=0x00 PREC=0x00 TTL=1 ID=17827 DF PROTO=2
Sep 16 13:54:28 omarchy NetworkManager[897]: <warn> [1789581268.6272] device (enp4s0f1u1): Activation: failed for connection 'Wired connection 2'
Sep 16 13:54:30 omarchy kernel: [UFW BLOCK] IN=wlp5s0 OUT= MAC=01:00:5e:00:00:01:a0:ad:9f:39:ef:00:08:00 SRC=192.168.50.1 DST=224.0.0.1 LEN=36 TOS=0x00 PREC=0x00 TTL=1 ID=30642 DF PROTO=2
Sep 16 13:54:50 omarchy kernel: [UFW BLOCK] IN=wlp5s0 OUT= MAC=01:00:5e:00:00:01:a0:ad:9f:39:ef:00:08:00 SRC=192.168.50.1 DST=224.0.0.1 LEN=36 TOS=0x00 PREC=0x00 TTL=1 ID=43544 DF PROTO=2
Sep 16 13:55:10 omarchy kernel: [UFW BLOCK] IN=wlp5s0 OUT= MAC=01:00:5e:00:00:01:a0:ad:9f:39:ef:00:08:00 SRC=192.168.50.1 DST=224.0.0.1 LEN=36 TOS=0x00 PREC=0x00 TTL=1 ID=56277 DF PROTO=2
Sep 16 13:55:13 omarchy NetworkManager[897]: <warn> [1789581313.6231] device (enp4s0f1u1): Activation: failed for connection 'Wired connection 2'
Sep 16 13:55:29 omarchy sudo[9356]: bkuenzi : a password is required ; PWD=/home/bkuenzi/Work ; USER=root ; COMMAND=/usr/bin/test -f /var/lib/omarchy/windows/docker-compose.yml
Sep 16 13:55:30 omarchy kernel: [UFW BLOCK] IN=wlp5s0 OUT= MAC=01:00:5e:00:00:01:a0:ad:9f:39:ef:00:08:00 SRC=192.168.50.1 DST=224.0.0.1 LEN=36 TOS=0x00 PREC=0x00 TTL=1 ID=58134 DF PROTO=2
Sep 16 13:55:35 omarchy sudo[9375]: bkuenzi : a password is required ; PWD=/home/bkuenzi/Work ; USER=root ; COMMAND=/usr/bin/true
Sep 16 13:55:50 omarchy kernel: [UFW BLOCK] IN=wlp5s0 OUT= MAC=01:00:5e:00:00:01:a0:ad:9f:39:ef:00:08:00 SRC=192.168.50.1 DST=224.0.0.1 LEN=36 TOS=0x00 PREC=0x00 TTL=1 ID=5863 DF PROTO=2
Sep 16 13:55:58 omarchy NetworkManager[897]: <warn> [1789581358.6281] device (enp4s0f1u1): Activation: failed for connection 'Wired connection 2'
Sep 16 13:56:10 omarchy kernel: [UFW BLOCK] IN=wlp5s0 OUT= MAC=01:00:5e:00:00:01:a0:ad:9f:39:ef:00:08:00 SRC=192.168.50.1 DST=224.0.0.1 LEN=36 TOS=0x00 PREC=0x00 TTL=1 ID=19358 DF PROTO=2
Sep 16 13:56:30 omarchy kernel: [UFW BLOCK] IN=wlp5s0 OUT= MAC=01:00:5e:00:00:01:a0:ad:9f:39:ef:00:08:00 SRC=192.168.50.1 DST=224.0.0.1 LEN=36 TOS=0x00 PREC=0x00 TTL=1 ID=35395 DF PROTO=2
Sep 16 13:56:43 omarchy NetworkManager[897]: <warn> [1789581403.6252] device (enp4s0f1u1): Activation: failed for connection 'Wired connection 2'
Sep 16 13:56:50 omarchy kernel: [UFW BLOCK] IN=wlp5s0 OUT= MAC=01:00:5e:00:00:01:a0:ad:9f:39:ef:00:08:00 SRC=192.168.50.1 DST=224.0.0.1 LEN=36 TOS=0x00 PREC=0x00 TTL=1 ID=48464 DF PROTO=2
Sep 16 13:57:10 omarchy kernel: [UFW BLOCK] IN=wlp5s0 OUT= MAC=01:00:5e:00:00:01:a0:ad:9f:39:ef:00:08:00 SRC=192.168.50.1 DST=224.0.0.1 LEN=36 TOS=0x00 PREC=0x00 TTL=1 ID=49047 DF PROTO=2
Sep 16 13:57:30 omarchy kernel: [UFW BLOCK] IN=wlp5s0 OUT= MAC=01:00:5e:00:00:01:a0:ad:9f:39:ef:00:08:00 SRC=192.168.50.1 DST=224.0.0.1 LEN=36 TOS=0x00 PREC=0x00 TTL=1 ID=60874 DF PROTO=2
Sep 16 13:57:50 omarchy kernel: [UFW BLOCK] IN=wlp5s0 OUT= MAC=01:00:5e:00:00:01:a0:ad:9f:39:ef:00:08:00 SRC=192.168.50.1 DST=224.0.0.1 LEN=36 TOS=0x00 PREC=0x00 TTL=1 ID=7503 DF PROTO=2
Sep 16 13:58:10 omarchy kernel: [UFW BLOCK] IN=wlp5s0 OUT= MAC=01:00:5e:00:00:01:a0:ad:9f:39:ef:00:08:00 SRC=192.168.50.1 DST=224.0.0.1 LEN=36 TOS=0x00 PREC=0x00 TTL=1 ID=9571 DF PROTO=2
Sep 16 13:58:50 omarchy kernel: [UFW BLOCK] IN=wlp5s0 OUT= MAC=01:00:5e:00:00:01:a0:ad:9f:39:ef:00:08:00 SRC=192.168.50.1 DST=224.0.0.1 LEN=36 TOS=0x00 PREC=0x00 TTL=1 ID=34645 DF PROTO=2
Sep 16 13:59:10 omarchy kernel: [UFW BLOCK] IN=wlp5s0 OUT= MAC=01:00:5e:00:00:01:a0:ad:9f:39:ef:00:08:00 SRC=192.168.50.1 DST=224.0.0.1 LEN=36 TOS=0x00 PREC=0x00 TTL=1 ID=48002 DF PROTO=2
Sep 16 13:59:30 omarchy kernel: [UFW BLOCK] IN=wlp5s0 OUT= MAC=01:00:5e:00:00:01:a0:ad:9f:39:ef:00:08:00 SRC=192.168.50.1 DST=224.0.0.1 LEN=36 TOS=0x00 PREC=0x00 TTL=1 ID=61666 DF PROTO=2
Sep 16 13:59:45 omarchy sudo[11573]: bkuenzi : a password is required ; PWD=/home/bkuenzi/Work ; USER=root ; COMMAND=/usr/bin/true
Sep 16 13:59:50 omarchy kernel: [UFW BLOCK] IN=wlp5s0 OUT= MAC=01:00:5e:00:00:01:a0:ad:9f:39:ef:00:08:00 SRC=192.168.50.1 DST=224.0.0.1 LEN=36 TOS=0x00 PREC=0x00 TTL=1 ID=8732 DF PROTO=2
Sep 16 14:00:10 omarchy kernel: [UFW BLOCK] IN=wlp5s0 OUT= MAC=01:00:5e:00:00:01:a0:ad:9f:39:ef:00:08:00 SRC=192.168.50.1 DST=224.0.0.1 LEN=36 TOS=0x00 PREC=0x00 TTL=1 ID=18287 DF PROTO=2
Sep 16 14:00:30 omarchy kernel: [UFW BLOCK] IN=wlp5s0 OUT= MAC=01:00:5e:00:00:01:a0:ad:9f:39:ef:00:08:00 SRC=192.168.50.1 DST=224.0.0.1 LEN=36 TOS=0x00 PREC=0x00 TTL=1 ID=29764 DF PROTO=2
Sep 16 14:00:50 omarchy kernel: [UFW BLOCK] IN=wlp5s0 OUT= MAC=01:00:5e:00:00:01:a0:ad:9f:39:ef:00:08:00 SRC=192.168.50.1 DST=224.0.0.1 LEN=36 TOS=0x00 PREC=0x00 TTL=1 ID=31285 DF PROTO=2
Sep 16 14:01:10 omarchy kernel: [UFW BLOCK] IN=wlp5s0 OUT= MAC=01:00:5e:00:00:01:a0:ad:9f:39:ef:00:08:00 SRC=192.168.50.1 DST=224.0.0.1 LEN=36 TOS=0x00 PREC=0x00 TTL=1 ID=35265 DF PROTO=2
Sep 16 14:01:30 omarchy kernel: [UFW BLOCK] IN=wlp5s0 OUT= MAC=01:00:5e:00:00:01:a0:ad:9f:39:ef:00:08:00 SRC=192.168.50.1 DST=224.0.0.1 LEN=36 TOS=0x00 PREC=0x00 TTL=1 ID=41286 DF PROTO=2
Sep 16 14:01:39 omarchy kernel: kvm_intel: L1TF CPU bug present and SMT on, data leak possible. See CVE-2018-3646 and https://www.kernel.org/doc/html/latest/admin-guide/hw-vuln/l1tf.html for details.
Sep 16 14:01:50 omarchy kernel: [UFW BLOCK] IN=wlp5s0 OUT= MAC=01:00:5e:00:00:01:a0:ad:9f:39:ef:00:08:00 SRC=192.168.50.1 DST=224.0.0.1 LEN=36 TOS=0x00 PREC=0x00 TTL=1 ID=45261 DF PROTO=2
Sep 16 14:02:10 omarchy kernel: [UFW BLOCK] IN=wlp5s0 OUT= MAC=01:00:5e:00:00:01:a0:ad:9f:39:ef:00:08:00 SRC=192.168.50.1 DST=224.0.0.1 LEN=36 TOS=0x00 PREC=0x00 TTL=1 ID=51197 DF PROTO=2
Sep 16 14:02:28 omarchy NetworkManager[897]: <warn> [1789581748.6271] device (enp4s0f1u1): Activation: failed for connection 'Wired connection 2'
Sep 16 14:02:30 omarchy kernel: [UFW BLOCK] IN=wlp5s0 OUT= MAC=01:00:5e:00:00:01:a0:ad:9f:39:ef:00:08:00 SRC=192.168.50.1 DST=224.0.0.1 LEN=36 TOS=0x00 PREC=0x00 TTL=1 ID=62982 DF PROTO=2
Sep 16 14:02:50 omarchy kernel: [UFW BLOCK] IN=wlp5s0 OUT= MAC=01:00:5e:00:00:01:a0:ad:9f:39:ef:00:08:00 SRC=192.168.50.1 DST=224.0.0.1 LEN=36 TOS=0x00 PREC=0x00 TTL=1 ID=10567 DF PROTO=2
Sep 16 14:03:10 omarchy kernel: [UFW BLOCK] IN=wlp5s0 OUT= MAC=01:00:5e:00:00:01:a0:ad:9f:39:ef:00:08:00 SRC=192.168.50.1 DST=224.0.0.1 LEN=36 TOS=0x00 PREC=0x00 TTL=1 ID=18705 DF PROTO=2
Sep 16 14:03:13 omarchy NetworkManager[897]: <warn> [1789581793.6241] device (enp4s0f1u1): Activation: failed for connection 'Wired connection 2'
Sep 16 14:03:30 omarchy kernel: [UFW BLOCK] IN=wlp5s0 OUT= MAC=01:00:5e:00:00:01:a0:ad:9f:39:ef:00:08:00 SRC=192.168.50.1 DST=224.0.0.1 LEN=36 TOS=0x00 PREC=0x00 TTL=1 ID=21293 DF PROTO=2
Sep 16 14:03:50 omarchy kernel: [UFW BLOCK] IN=wlp5s0 OUT= MAC=01:00:5e:00:00:01:a0:ad:9f:39:ef:00:08:00 SRC=192.168.50.1 DST=224.0.0.1 LEN=36 TOS=0x00 PREC=0x00 TTL=1 ID=31861 DF PROTO=2
Sep 16 14:03:58 omarchy NetworkManager[897]: <warn> [1789581838.6270] device (enp4s0f1u1): Activation: failed for connection 'Wired connection 2'
Sep 16 14:04:10 omarchy kernel: [UFW BLOCK] IN=wlp5s0 OUT= MAC=01:00:5e:00:00:01:a0:ad:9f:39:ef:00:08:00 SRC=192.168.50.1 DST=224.0.0.1 LEN=36 TOS=0x00 PREC=0x00 TTL=1 ID=46434 DF PROTO=2
Sep 16 14:04:30 omarchy kernel: [UFW BLOCK] IN=wlp5s0 OUT= MAC=01:00:5e:00:00:01:a0:ad:9f:39:ef:00:08:00 SRC=192.168.50.1 DST=224.0.0.1 LEN=36 TOS=0x00 PREC=0x00 TTL=1 ID=57892 DF PROTO=2
Sep 16 14:04:43 omarchy NetworkManager[897]: <warn> [1789581883.6240] device (enp4s0f1u1): Activation: failed for connection 'Wired connection 2'
Sep 16 14:04:50 omarchy kernel: [UFW BLOCK] IN=wlp5s0 OUT= MAC=01:00:5e:00:00:01:a0:ad:9f:39:ef:00:08:00 SRC=192.168.50.1 DST=224.0.0.1 LEN=36 TOS=0x00 PREC=0x00 TTL=1 ID=62024 DF PROTO=2
Sep 16 14:05:10 omarchy kernel: [UFW BLOCK] IN=wlp5s0 OUT= MAC=01:00:5e:00:00:01:a0:ad:9f:39:ef:00:08:00 SRC=192.168.50.1 DST=224.0.0.1 LEN=36 TOS=0x00 PREC=0x00 TTL=1 ID=2244 DF PROTO=2
Sep 16 14:05:30 omarchy kernel: [UFW BLOCK] IN=wlp5s0 OUT= MAC=01:00:5e:00:00:01:a0:ad:9f:39:ef:00:08:00 SRC=192.168.50.1 DST=224.0.0.1 LEN=36 TOS=0x00 PREC=0x00 TTL=1 ID=14099 DF PROTO=2
Sep 16 14:05:57 omarchy kernel: warning: `ThreadPoolForeg' uses wireless extensions which will stop working for Wi-Fi 7 hardware; use nl80211
Sep 16 14:06:10 omarchy kernel: [UFW BLOCK] IN=wlp5s0 OUT= MAC=01:00:5e:00:00:01:a0:ad:9f:39:ef:00:08:00 SRC=192.168.50.1 DST=224.0.0.1 LEN=36 TOS=0x00 PREC=0x00 TTL=1 ID=36267 DF PROTO=2
Sep 16 14:06:30 omarchy kernel: [UFW BLOCK] IN=wlp5s0 OUT= MAC=01:00:5e:00:00:01:a0:ad:9f:39:ef:00:08:00 SRC=192.168.50.1 DST=224.0.0.1 LEN=36 TOS=0x00 PREC=0x00 TTL=1 ID=45750 DF PROTO=2
Sep 16 14:06:50 omarchy kernel: [UFW BLOCK] IN=wlp5s0 OUT= MAC=01:00:5e:00:00:01:a0:ad:9f:39:ef:00:08:00 SRC=192.168.50.1 DST=224.0.0.1 LEN=36 TOS=0x00 PREC=0x00 TTL=1 ID=56862 DF PROTO=2
Sep 16 14:07:10 omarchy kernel: [UFW BLOCK] IN=wlp5s0 OUT= MAC=01:00:5e:00:00:01:a0:ad:9f:39:ef:00:08:00 SRC=192.168.50.1 DST=224.0.0.1 LEN=36 TOS=0x00 PREC=0x00 TTL=1 ID=64878 DF PROTO=2
Sep 16 14:07:30 omarchy kernel: [UFW BLOCK] IN=wlp5s0 OUT= MAC=01:00:5e:00:00:01:a0:ad:9f:39:ef:00:08:00 SRC=192.168.50.1 DST=224.0.0.1 LEN=36 TOS=0x00 PREC=0x00 TTL=1 ID=15661 DF PROTO=2
Sep 16 14:08:10 omarchy kernel: [UFW BLOCK] IN=wlp5s0 OUT= MAC=01:00:5e:00:00:01:a0:ad:9f:39:ef:00:08:00 SRC=192.168.50.1 DST=224.0.0.1 LEN=36 TOS=0x00 PREC=0x00 TTL=1 ID=24743 DF PROTO=2
Sep 16 14:08:30 omarchy kernel: [UFW BLOCK] IN=wlp5s0 OUT= MAC=01:00:5e:00:00:01:a0:ad:9f:39:ef:00:08:00 SRC=192.168.50.1 DST=224.0.0.1 LEN=36 TOS=0x00 PREC=0x00 TTL=1 ID=38083 DF PROTO=2
=========================================
INSTALLED PACKAGES
=========================================
aether 4.29.8-1 (omarchy)
alsa-utils 1.2.16-1 (extra)
apple-bcm-firmware 14.0-1 (AUR)
apple-t2-audio-config 0.4.r21.ga973d53-1 (arch-mact2)
asdcontrol 1:0.6.0-2 (omarchy)
base 3-3 (core)
base-devel 1-2 (core)
bash-completion 2.18.0-1 (extra)
bat 0.26.1-2 (extra)
bluez 5.87-2 (extra)
bluez-tools 0.2.0-6 (extra)
bluez-utils 5.87-2 (extra)
bolt 0.9.11-3 (extra)
brightnessctl 0.5.1-3 (extra)
btop 1.4.7-1 (extra)
btrfs-progs 7.1-1 (core)
chromium 152.0.7977.82-1 (extra)
clang 22.1.8-1 (extra)
cliamp 2.0.1-1 (omarchy)
cups 2:2.4.19-1 (extra)
cups-filters 2.0.1-2 (extra)
cups-pk-helper 0.2.7-2 (extra)
ddcutil 2.2.7-1 (extra)
docker 1:29.7.2-1 (extra)
docker-buildx 0.37.0-1 (extra)
docker-compose 5.5.1-1 (extra)
dosfstools 4.2-5 (core)
dotnet-runtime 10.0.11.sdk111-1 (extra)
dua-cli 2.44.0-1 (extra)
efibootmgr 18-4 (core)
evince 1:48.4-1 (extra)
exfatprogs 1.4.3-1 (extra)
expac 10-13 (extra)
eza 0.23.5-2 (extra)
fastfetch 2.68.1-1 (extra)
fcitx5 5.1.22-1 (extra)
fcitx5-gtk 5.1.7-1 (extra)
fcitx5-qt 5.1.15-1 (extra)
fd 10.5.0-3 (extra)
ffmpegthumbnailer 2.3.1-1 (extra)
foot 1.28.0-1 (extra)
freerdp 2:3.31.1-1 (extra)
fzf 0.74.3-1 (extra)
git 2.55.0-1 (extra)
gnome-disk-utility 46.1-3 (extra)
gnome-keyring 1:50.0-1 (extra)
gnome-themes-extra 1:3.28-1 (extra)
gpu-screen-recorder 5.12.3-2 (omarchy)
gpu-screen-recorder 6.1.0-1 (extra)
grim 1.5.0-2 (extra)
gst-plugin-pipewire 1:1.6.8-1 (extra)
gvfs-mtp 1.60.2-4 (extra)
gvfs-nfs 1.60.2-4 (extra)
gvfs-smb 1.60.2-4 (extra)
herdr 0.8.2-1 (omarchy)
hyprland 0.56.2-2 (extra)
hyprland-guiutils 0.2.2-3 (extra)
hyprland-preview-share-picker 0.2.1-1 (omarchy)
hyprpicker 0.4.7-4 (extra)
hyprsunset 0.4.0-3 (extra)
imagemagick 7.1.2.31-1 (extra)
imv 5.0.1-2 (extra)
inetutils 2.8-1 (core)
inotify-tools 4.25.9.0-1 (extra)
intel-media-driver 26.2.4-1 (extra)
intel-ucode 20260812-1 (extra)
inxi 3.3.41.1-1 (extra)
jq 1.8.2-1 (extra)
kdenlive 26.08.0-1 (extra)
kernel-modules-hook 0.1.7-3 (extra)
lazydocker 0.25.2-1 (extra)
lazygit 0.65.0-1 (extra)
less 1:704-1 (core)
libpulse 17.0+r98+gb096704c0-1 (extra)
libreoffice-fresh 26.8.0-2 (extra)
libvips 8.18.6-1 (extra)
libyaml 0.2.5-3 (extra)
limine 12.8.0-1 (extra)
linux-firmware 20260810-2 (core)
linux-t2 7.2.6.arch2-1 (arch-mact2)
linux-t2-headers 7.2.6.arch2-1 (arch-mact2)
llvm 22.1.8-2 (extra)
localsend 1.18.2-1 (omarchy)
lua51 5.1.5-13 (extra)
luarocks 3.13.0-5 (extra)
man-db 2.13.1-2 (core)
mariadb-libs 12.3.3-2 (extra)
mise-bin 2026.9.7-1 (omarchy)
mkinitcpio 41.1-1 (core)
moonlight-qt 6.1.0-7 (extra)
mpv 1:0.41.0-6 (extra)
mpv-mpris 1.2-2 (extra)
nautilus 50.3.1-1 (extra)
nautilus-python 4.1.0-3 (extra)
networkmanager 1.58.1-1 (extra)
noto-fonts 1:2026.09.01-1 (extra)
noto-fonts-cjk 20240730-1 (extra)
noto-fonts-emoji 1:2.051-1 (extra)
nss-mdns 0.15.1-2 (extra)
obsidian 1.13.7-2 (extra)
obs-studio 32.2.2-1 (extra)
omacalc 0.2.2-1 (omarchy)
omacut 0.4.0-1 (omarchy)
omarchy 4.0.4-1 (omarchy)
omarchy-keyring 20251027-1 (omarchy)
omarchy-nvim 2026.8.13-1 (omarchy)
omarchy-settings 4.0.4-1 (omarchy)
omawrite 0.5.0-1 (omarchy)
openbsd-netcat 1.238_1-1 (extra)
pacman-contrib 1.13.1-1 (extra)
pamixer 1.6-4 (extra)
pinta 3.1.2-1 (omarchy)
pinta 3.1.2-2 (extra)
pipewire 1:1.6.8-1 (extra)
pipewire-alsa 1:1.6.8-1 (extra)
pipewire-jack 1:1.6.8-1 (extra)
pipewire-pulse 1:1.6.8-1 (extra)
plocate 1.1.25-1 (extra)
postgresql-libs 18.6-1 (extra)
power-profiles-daemon 0.30-1 (extra)
python-gobject 3.56.3-1 (extra)
python-poetry-core 2.4.1-1 (extra)
qemu-user-static-binfmt 11.1.1-1 (extra)
qrencode 4.1.1-4 (extra)
qt6-imageformats 6.11.2-1 (extra)
quickshell 0.3.1-1 (extra)
ripgrep 15.2.0-1 (extra)
ruby 3.4.10-1 (extra)
sddm 0.21.0-7 (extra)
slurp 1.5.0-2 (extra)
socat 1.8.1.3-1 (extra)
starship 1.26.0-1 (extra)
sudo 1.9.17.p2-6 (core)
sushi 50.0-1 (extra)
system-config-printer 1.5.18-7 (extra)
t2fanrd r16.48baf96-1 (arch-mact2)
tensaku 0.29.0-1 (omarchy)
tesseract 5.5.3-1 (extra)
tesseract-data-eng 2:4.1.0-5 (extra)
thermald 2:2.5.12-1 (extra)
tldr 3.4.4-1 (extra)
tmux 3.7_c-1 (extra)
tobi-try 1.8.1-3 (omarchy)
tree-sitter-cli 0.26.9-1 (extra)
ttf-ia-writer 20181225-1 (omarchy)
ttf-jetbrains-mono-nerd-basic 3.5.1-1 (omarchy)
ttfx 0.3.2-1 (omarchy)
tzupdate 3.1.0-1 (omarchy)
udiskie 2.7.0-2 (extra)
ufw 0.36.2-7 (extra)
ufw-docker 251123-1 (omarchy)
usage 5.1.0-1 (extra)
uwsm 0.26.7-1 (extra)
voxtype-bin 1.0.1-1 (omarchy)
vpl-gpu-rt 26.2.4-1 (extra)
vulkan-asahi 1:26.2.2-1 (extra)
vulkan-intel 1:26.2.2-1 (extra)
vulkan-radeon 1:26.2.2-1 (extra)
whois 5.6.6-1 (extra)
wireless-regdb 2026.05.30-1 (core)
wireplumber 0.5.17-1 (extra)
wl-clipboard 1:2.3.0-1 (extra)
woff2-font-awesome 7.3.1-1 (extra)
wtype 0.4-2 (extra)
xdg-desktop-portal-gtk 1.15.3-1 (extra)
xdg-desktop-portal-hyprland 1.4.1-2 (extra)
xdg-terminal-exec 0.14.3-1 (omarchy)
xournalpp 1.3.7-1 (extra)
yaru-icon-theme 26.04.5.1ubuntu-1 (omarchy)
yay 13.0.1-1 (omarchy)
yt-dlp 2026.08.19-1 (extra)
zbar 0.23.93-7 (extra)
zoxide 0.10.0-1 (extra)
zram-generator 1.2.1-1 (extra)
```
</details>
Validation
Not checked yet. A validator will restate this report as checkable claims, map it to the project's requirements and write a reproducer that the proof engine runs.
Linked
Not linked to any known issue, other report or change yet.
Decision
Decisions are recorded by our staff — or, where this project allows it, by agents: checked by a second, independent agent, or by a single agent where the project's policy says so. Any decision reached so far is shown below.
No decision has been recorded yet.